{"text_format":"3","workbook":"xlsx","n_sheets":13,"sheets":["INGRESOS","AFILIACIONES Y PERMISOS 2024","AFILIACIONES Y PERMISOS 2025","GAL'S 2025 ","CERTIFICADOS DE ASCENSO 2025","FESTIVAL Y SELECTIVO JUNIOR","OPEN DE LA FAMILIA","CAMPEONATO ESCOLAR - COLEGIAL","II OPEN INT NOV AVA POOM","ACTUALIZACIÓN DE ARBITRAJE","HANMADANG - OPEN CLASIFICADOS","EGRESOS","CUENTAS POR COBRAR Y POR PAGAR"],"not_rendered":{"images":2,"defined_names":4},"read":"whole","date_system":"1900"}

{"sheet":"INGRESOS","index":0,"n_rows":25,"n_cols":7,"rows_kept":25,"merged":[[5,1,5,6],[11,1,16,1],[18,1,20,1],[21,1,23,1],[24,1,24,5]]}
[]
[]
[]
[]
[]
[null,"INGRESOS DEL 16 DE MARZO AL 05 DE SEPTIEMBRE DE 2025 "]
[null,"INGRESOS PRINCIPALES","ITEMS SECUNDARIOS","EFECTIVO","TRANSFERENCIA","INGRESO (EFE + TRANS)","VALOR (INGRESO-EGRESOS)"]
[null,"AFILIACIONES Y PERMISOS DE FUNCIONAMIENTO 2024 CANCELADOS DE MARZO 16 A SEPTIMEBRE 05",null,0,{"$f":"'AFILIACIONES Y PERMISOS 2024'!G130","v":{"v":70,"d":"$ 70.00"}},{"$f":"SUM(E8:E8)","v":{"v":70,"d":"$ 70.00"}},{"$f":"SUM(E8:E8)","v":{"v":70,"d":"$ 70.00"}}]
[null,"AFILIACIONES Y PERMISOS DE FUNCIONAMIENTO 2025 CANCELADOS DE MARZO 16 A SEPTIMEBRE 05",null,{"$f":"'AFILIACIONES Y PERMISOS 2025'!H141","v":{"v":340,"d":"$ 340.00"}},{"$f":"'AFILIACIONES Y PERMISOS 2025'!G139-'AFILIACIONES Y PERMISOS 2025'!H141","v":{"v":2970,"d":"$ 2,970.00"}},{"$f":"SUM(D9:E9)","v":{"v":3310,"d":"$ 3,310.00"}},{"$f":"SUM(D9:E9)","v":{"v":3310,"d":"$ 3,310.00"}}]
[null,"LICENCIA DEPORTIVA ANUAL (CARNETS)",null,{"$f":"'GAL''S 2025 '!F206","v":{"v":602,"d":"$ 602.00"}},{"$f":"'GAL''S 2025 '!G206","v":{"v":5662,"d":"$ 5,662.00"}},{"$f":"D10+E10","v":{"v":6264,"d":"$ 6,264.00"}},{"$f":"SUM(D10:E10)","v":{"v":6264,"d":"$ 6,264.00"}}]
[null,"CERTIFICADOS DE ASCENSO",null,{"$f":"'CERTIFICADOS DE ASCENSO 2025'!C120","v":{"v":886,"d":"$ 886.00"}},{"$f":"'CERTIFICADOS DE ASCENSO 2025'!C121","v":{"v":4001.5,"d":"$ 4,001.50"}},{"$f":"D11+E11","v":{"v":4887.5,"d":"$ 4,887.50"}},{"$f":"SUM(D11:E11)","v":{"v":4887.5,"d":"$ 4,887.50"}}]
[null,"EVENTOS DE MARZO 16 A SEPTIMEBRE 05","FESTIVAL DE HABILIDADES MOTRICES Y SELECTIVO JUNIOR ",{"$f":"'FESTIVAL Y SELECTIVO JUNIOR'!C41+'FESTIVAL Y SELECTIVO JUNIOR'!C43","v":{"v":1626,"d":"$ 1,626.00"}},{"$f":"'FESTIVAL Y SELECTIVO JUNIOR'!C42","v":{"v":1235,"d":"$ 1,235.00"}},{"$f":"D12+E12","v":{"v":2861,"d":"$ 2,861.00"}},{"$f":"INGRESOS!F12-'FESTIVAL Y SELECTIVO JUNIOR'!C64","v":{"v":1269.85,"d":"$ 1,269.85"}}]
[null,null,"OPEN DE LA FAMILIA (04-05-2025)",{"$f":"'OPEN DE LA FAMILIA'!C26+'OPEN DE LA FAMILIA'!C28","v":{"v":340,"d":"$ 340.00"}},{"$f":"'OPEN DE LA FAMILIA'!C27","v":{"v":1110,"d":"$ 1,110.00"}},{"$f":"SUM(D13:E13)","v":{"v":1450,"d":"$ 1,450.00"}},{"$f":"F13-'OPEN DE LA FAMILIA'!C43","v":{"v":788,"d":"$ 788.00"}}]
[null,null,"TORNEO INTERESCOLAR E INTERCOLEGIAL (10-05-2025)",{"$f":"'CAMPEONATO ESCOLAR - COLEGIAL'!C108+'CAMPEONATO ESCOLAR - COLEGIAL'!C110","v":{"v":2298.5,"d":"$ 2,298.50"}},{"$f":"'CAMPEONATO ESCOLAR - COLEGIAL'!C109","v":{"v":8101.5,"d":"$ 8,101.50"}},{"$f":"SUM(D14:E14)","v":{"v":10400,"d":"$ 10,400.00"}},{"$f":"F14-'CAMPEONATO ESCOLAR - COLEGIAL'!C142","v":{"v":5189.88,"d":"$ 5,189.88"}}]
[null,null,"II OPEN NOVATOS - INTERMEDIOS COMBATE Y POOMSAE  - PRIMER OPEN POOMSAE AVANZADO (5Y6-07-2025)",0,{"$f":"'II OPEN INT NOV AVA POOM'!C67","v":{"v":14185,"d":"$ 14,185.00"}},{"$f":"SUM(D15:E15)","v":{"v":14185,"d":"$ 14,185.00"}},{"$f":"F15-'II OPEN INT NOV AVA POOM'!C98","v":{"v":6074.97,"d":"$ 6,074.97"}}]
[null,null,"CURSO DE ACTUALIZACIÓN DE ARBITRAJE DE COMBATE (18 Y 19 -07-2025)",{"$f":"'ACTUALIZACIÓN DE ARBITRAJE'!C196","v":{"v":892.5,"d":"$ 892.50"}},{"$f":"'ACTUALIZACIÓN DE ARBITRAJE'!C197","v":{"v":1725,"d":"$ 1,725.00"}},{"$f":"D16+E16","v":{"v":2617.5,"d":"$ 2,617.50"}},{"$f":"F16-'ACTUALIZACIÓN DE ARBITRAJE'!C214","v":{"v":1626.86,"d":"$ 1,626.86"}}]
[null,null,"HANMADANG -  OPEN CLASIFICADOS (09-08-2025)",{"$f":"'HANMADANG - OPEN CLASIFICADOS'!C23+'HANMADANG - OPEN CLASIFICADOS'!C25","v":{"v":472,"d":"$ 472.00"}},{"$f":"'HANMADANG - OPEN CLASIFICADOS'!C24","v":{"v":858,"d":"$ 858.00"}},{"$f":"D17+E17","v":{"v":1330,"d":"$ 1,330.00"}},{"$f":"F17-'HANMADANG - OPEN CLASIFICADOS'!C47","v":{"v":179.04999999999995,"d":"$ 179.05"}}]
[null,"CHIMBACALLE","MENSUALIDADES",0,0,{"v":4656.25,"d":"$ 4,656.25"},{"v":4656.25,"d":"$ 4,656.25"}]
[null,"MULTAS","PAGO MULTA BLUE DRAGONS (30-05-2025)",0,0,{"v":100,"d":"$ 100.00"},{"v":100,"d":"$ 100.00"}]
[null,null,"PAGO MULTA ATLAS (03-07-2025)",0,0,{"v":100,"d":"$ 100.00"},{"v":100,"d":"$ 100.00"}]
[null,null,"PAGO MULTA MINOTAUROS (31-07-2025)",0,0,{"v":100,"d":"$ 100.00"},{"v":100,"d":"$ 100.00"}]
[null,"OTROS","PAGO DE SALDO POR TRÁMITE DE GAL'S Y CERTIFICADOS (TEAM TAURO) DE ACUERDO A COMPROMISO DE PAGO",0,0,{"v":20,"d":"$ 20.00"},{"v":20,"d":"$ 20.00"}]
[null,null,"CURSO DE ACREDITACIÓN ENTRENADORES REZAGADOS","CUENTA ASOTKD-P",{"v":40,"d":"$ 40.00"},{"v":40,"d":"$ 40.00"},{"$f":"E23","v":{"v":40,"d":"$ 40.00"}}]
[null,null,"ALQUILER DE TATAMI A FEDDY PONCE (28-08-2025)","CUENTA ASOTKD-P",{"v":30,"d":"$ 30.00"},{"v":40,"d":"$ 40.00"},{"$f":"E24","v":{"v":30,"d":"$ 30.00"}}]
[null,"TOTAL",{"$nulls":4},{"$f":"SUM(G8:G24)","v":{"v":34706.36,"d":"$ 34,706.36"}}]

{"sheet":"AFILIACIONES Y PERMISOS 2024","index":1,"n_rows":138,"n_cols":11,"rows_kept":138,"merged":[[8,3,9,3],[8,6,9,6],[8,7,9,7],[8,8,9,8],[8,9,9,9],[129,4,129,5]]}
{"$rows_empty":8}
[{"$nulls":3},"N°","CLUBES FILIALES","FUNCIONAMIENTO 2024","PAGO","N° COMPROBANTE/FECHA","ESTADO","DEUDA"]
[{"$nulls":4},"CLUB","REPRESENTANTE"]
[{"$nulls":3},1,"Apolo","Mario Pinto","ANTERIOR $70","BP. 34579953  13-11-2024","PAGADO",0]
[{"$nulls":3},2,"Ares","Fernando Manosalvas","ANTERIOR $70","BP. 69041936- 05-09-2024","PAGADO",0]
[{"$nulls":3},3,"Atlas Club","Edgar Varela","ANTERIOR $70","BP. 110392984 - 13-01-2025","PAGADO",0]
[{"$nulls":3},4,"BaekJul BG","Jorge Proaño","ANTERIOR $70","002312977 - 18-01-2024","PAGADO",0]
[{"$nulls":3},5,"BaekJul BG (Sucursal)","Daniel Ayala","ANTERIOR $50","BP. 160291895 - 22-01-2024","PAGADO",0]
[{"$nulls":3},6,"Bas Panthers","Jonatan Bastidas","ANTERIOR $100","COP.P.N. 5750- 23-04-2024/ B.P. 25633758 - 14-08-2024","PAGADO",0]
[{"$nulls":3},7,"Bas Panthers Pintag (Sucursal)","Jonatan Bastidas","ANTERIOR $50","BG. 0001655422 - 15-08-2024","PAGADO",0]
[{"$nulls":3},8,"Borja Lions","Edgar Borja","ANTERIOR $70","BP. 53210770 - 08-02-2024","PAGADO",0]
[{"$nulls":3},9,"Blue Drangons","William Suntaxi","ANTERIOR $200","BP. 17281887-26-07-2024","PAGADO",0]
[{"$nulls":3},10,"Ciudad de Quito","Fernando Jaramillo","ANTERIOR $70","34719163 - 16-01-2024","PAGADO",0]
[{"$nulls":3},11,"Ciudad de Quito (Sucursal)","Adriana Obando","ANTERIOR $50","BP. 105725396- 05-09-2024","PAGADO",0]
[{"$nulls":3},12,"Condor","Juan Carlos Ramírez","ANTERIOR $70",null,"CRUCE DEUDA",0]
[{"$nulls":3},13,"Chen Huu","Pablo Cobos","ANTERIOR $70","BP. 29399075 15-03-2024","PAGADO",0]
[{"$nulls":3},14,"Chonkwon","Christian Javier Huaraca  ",{"v":70,"d":"$ 70.00"},"BP. 25891003 08-07-2025","PAGADO",0]
[{"$nulls":3},15,"Chung Song","Carlos Morocho","ANTERIOR $70","BP. 8942157 06-02-2024","PAGADO",0]
[{"$nulls":3},16,"Champions for live","Byron Berrones","ANTERIOR $200","BP. 39643133- 06-09-2024","PAGADO",0]
[{"$nulls":3},17,"Daigoro","Edison Pérez V.","ANTERIOR $70","BP. 21042379-05-07-2024","PAGADO",0]
[{"$nulls":3},18,"Daigoro Sucursal  Sector El Beaterio","Edison Pérez V.","ANTERIOR $50","BP. 21042379-05-07-2024","PAGADO",0]
[{"$nulls":3},19,"Debak TKD","Jimmy Bolaños","ANTERIOR $146","PASO DEUDA 18-07-2024","PAGADO",0]
[{"$nulls":3},20,"Debak TKD Colegio de Liga","Fredy Hidalgo","ANTERIOR $50","PASO DEUDA 18-07-2024","PAGADO",0]
[{"$nulls":3},21,"Deciap","Pablo Tayo","ANTERIOR $70","SERVICIOS PROFESIONALES","CANJE",0]
[{"$nulls":3},22,"Deciap Norte","Joel Mogollon",0,null,"PENDIENTE",{"v":50,"d":"$ 50.00"}]
[{"$nulls":3},23,"Dojang Taekwondo Melo","Vinicio Melo","ANTERIOR $70","73827343 - 16-01-2024","PAGADO",0]
[{"$nulls":3},24,"Draco","Edison Rodríguez","ANTERIOR $70","BP.55066275-8-08-2024","PAGADO",0]
[{"$nulls":3},25,"Dragon Gym","Miguel Aguas","ANTERIOR $70","BP.103149991-03-06-2024","PAGADO",0]
[{"$nulls":3},26,"Dragon Lee Gym","Edgar Lema","ANTERIOR  $70","INICIO AÑO 2024","PAGADO",0]
[{"$nulls":3},27,"Ecuadcuba/ Black Panthers","Eddy Cajigal  Kindelan","ANTERIOR $70","EFECTIVO 16-02-2025","PAGADO",0]
[{"$nulls":3},28,"Ecuador ","Jorge Astudillo","ANTERIOR $70","74095048 - 16-01-2024","PAGADO",0]
[{"$nulls":3},29,"Equilibrio","Juan Valencia","ANTERIOR $70","690260924 - 12-01-2024","PAGADO",0]
[{"$nulls":3},30,"ESPE","Eduardo Loachamín","ANTERIOR $70","SERVICIOS PROFESIONALES","PAGADO",0]
[{"$nulls":3},31,"ESMIL - Eloy Alfaro","Raúl Aucancela","ANTERIOR","CONVENIO INTERINSTITUCIONAL","CANJE",0]
[{"$nulls":3},32,"Farang","Mesias Rojas","ANTERIOR $70","BP. 191879288 - 19-08-2024","PAGADO",0]
[{"$nulls":3},33,"Fitt kwon do","Galo Garzón ","ANTERIOR $70","BP. 36797612-18-09-2024","PAGADO",0]
[{"$nulls":3},34,"First Class Calderon","Lenin Plazarte","ANTERIOR $70","B.P. 82900555-28-10-2024/ PA. 6305683 - 15-01-2025","PAGADO",0]
[{"$nulls":3},35,"Furia Negra","Franklin Caiza","ANTERIOR $70","BP. 46232939 - 05-09-2024","PAGADO",0]
[{"$nulls":3},36,"Grand Master ","César Tayo","ANTERIOR $70","PAGO POR USO DE PÁGINA DE EVENTOS","PAGADO",0]
[{"$nulls":3},37,"Goyang - Ideul","Luis Elias Pisuña","ANTERIOR $270","P.O.00077-11-04-24","PAGADO",0]
[{"$nulls":3},38,"Han Su","Mauricio Valladares","ANTERIOR $70","PAGO POR DIPLOMAS","PAGADO",0]
[{"$nulls":3},39,"Himchari Dojang","Claudia Cárdenas","ANTERIOR $70","BP. 19157477 - 28-08-2024","PAGADO",0]
[{"$nulls":3},40,"Huang Top Gym","Guido Mejia","ANTERIOR $70","Pro.155311020900-22-11-24","PAGADO",0]
[{"$nulls":3},41,"Ilyo MP","Miguel Parra","ANTERIOR $75","Pro.155311020900-22-11-24","PAGADO",0]
[{"$nulls":3},42,"Ji Do Kwan","David Del Castillo","ANTERIOR $70","Prod.1219880209-07-06-24","PAGADO",0]
[{"$nulls":3},43,"Joseon Legacy","Fernando Moya","ANTERIOR $70","Pago en curso de entrenadores","PAGADO",0]
[{"$nulls":3},44,"JR Sport","Juan Carlos Ramírez","ANTERIOR $70","BG 9916798 15-03-2024","PAGADO",0]
[{"$nulls":3},45,"Juventus","Jhony Pavón","ANTERIOR $70","BG. 0003214632-05-09-2024","PAGADO",0]
[{"$nulls":3},46,"Jerathel","Samantha Mogollon","ANTERIOR $50","EN DB.P.125575249 - 28-10-2024","PAGADO",0]
[{"$nulls":3},47,"Ko América","Miguel Angél Pavón","ANTERIOR $70","PASO SERVICIO DE INTERNET FIJO XTRIM TV CABLE","PAGADO",0]
[{"$nulls":3},48,"Ko América Caupicho","Bryan Chalcualan","ANTERIOR $50","PASO SERVICIO DE INTERNET FIJO XTRIM TV CABLE","PAGADO",0]
[{"$nulls":3},49,"Ko América Santo Tomas","Bryan Chalcualan","ANTERIOR $50","BP. 51813288- 12-07-2024","PAGADO",0]
[{"$nulls":3},50,"Ko América Dragon de Fuego","Luis Sandoval","ANTERIOR $50","BP. 26570994-02-10-2024","PAGADO",0]
[{"$nulls":3},51,"Korean Dragon","Fabián Moreno","ANTERIOR $70","BP.20228234 - 23-07-2024","PAGADO",0]
[{"$nulls":3},52,"Koryo","Guillermo Puga - Sharon López","ANTERIOR $70","B.P. 99611502- 16-05-24","PAGADO",0]
[{"$nulls":3},53,"Koryo Sucursal","Edwin Delgado","ANTERIOR $50","B.P. 99611502- 16-05-24","PAGADO",0]
[{"$nulls":3},54,"Koryo Sucursal","Dayana Folleco","ANTERIOR $50","SERVICIOS PROFESIONALES ","PAGADO",0]
[{"$nulls":3},55,"Kukkiwon","David Chicaiza","ANTERIOR $70","BP. 186207888 5-07-2024","PAGADO",0]
[{"$nulls":3},56,"Kumgan Dul","Fabián García","ANTERIOR $70","BP. 16642518-30-12-2024","PAGADO",0]
[{"$nulls":3},57,"Kyorugui Gym","Vinicio Cardona","ANTERIOR $45","2024-09-06","PAGADO",0]
[{"$nulls":3},58,"León","Romel  Pilaquinga","ANTERIOR $30","BP. 61286404- 05-09-2024","PAGADO",0]
[{"$nulls":3},59,"Liga Deportiva Cantonal Mejía","Fernando Manosalvas","ANTERIOR $70","BP. 6894312 10-07-2024","PAGADO",0]
[{"$nulls":3},60,"Lithe body","Norma Ortíz ","ANTERIOR $70","BP. 41487117- 20-02-2024","PAGADO",0]
[{"$nulls":3},61,"Lobos","Cristian Flores","ANTERIOR $70","BP. 10046769 - 15-01-2025","PAGADO",0]
[{"$nulls":3},62,"Los Pumas","Galo Gavilanez","ANTERIOR $70","BP. 46146086-05-09-2024","PAGADO",0]
[{"$nulls":3},63,"Master Home","Marlon Lema","ANTERIOR $70","DEPÓSITO 12-12-2024","PAGADO",0]
[{"$nulls":3},64,"Marcial Club Granda","Luis Granda","ANTERIOR $70","19254425 - 12-01-2024","PAGADO",0]
[{"$nulls":3},65,"Mercenarios","Luis Cano","ANTERIOR $70","OPEN DE LIMA","CANJE DEUDA",0]
[{"$nulls":3},66,"Mikido","Daniel Guerra","ANTERIOR $270","B.P. 93929997-26-03-2024","PAGADO",0]
[{"$nulls":3},67,"Millenium","Jean Galora","ANTERIOR $70","42113-16-05-24","PAGADO",0]
[{"$nulls":3},68,"Michay","Luisa Vega","ANTERIOR $70","BP. 20092834- 05-03-2024","PAGADO",0]
[{"$nulls":3},69,"Minotaurus","Marco Duchi","ANTERIOR $70","71140294 - 17-01-2024","PAGADO",0]
[{"$nulls":3},70,"Mit-TKD","Mellany Inasunta","ANTERIOR $70","92260917 - 04-01-2024","PAGADO",0]
[{"$nulls":3},71,"Mit -TKD Sucursal","Jared Vargas","ANTERIOR $50","47864538 - 16-01-2024","PAGADO",0]
[{"$nulls":3},72,"Paladins","Jeann Paladines","ANTERIOR $70","BP. 234822309-10-06-2024","PAGADO",0]
[{"$nulls":3},73,"Pandademon","Andrés Herrera","ANTERIOR $70","BP. 61932362- 13-01-2024","PAGADO",0]
[{"$nulls":3},74,"Pionero Fortis","Xavier Moreira Fortis","ANTERIOR $70","B.P. 3585973-13-12-20","PAGADO",0]
[{"$nulls":3},75,"Pionero Mejía","Luís Burbano","ANTERIOR $70","BP. 38675762- 13-01-2025","PAGADO",0]
[{"$nulls":3},76,"Pyongyang","Luisa Vega","ANTERIOR $70","BP. 46309319 - 24-01-2024","PAGADO",0]
[{"$nulls":3},77,"Raig de llum","Fernando Ruiz","ANTERIOR $70","BP.29220414-22-05-2024","PAGADO",0]
[{"$nulls":3},78,"Tanaka Red","Carlos Estrella","ANTERIOR $70","PRO.190784020900-23-01-2024","PAGADO",0]
[{"$nulls":3},79,"Renacer","Milton Ramos","ANTERIOR $70","2304516 - 12-01-2024","PAGADO",0]
[{"$nulls":3},80,"Rojas Iron First","Jorge Rojas","ANTERIOR $70","45438497- 12-01-2024","PAGADO",0]
[{"$nulls":3},81,"S.D.Central","Carlos Reinoso","ANTERIOR $70","BP. 7707848 - 22-01-2024","PAGADO",0]
[{"$nulls":3},82,"San Francisco Tigres","Carlos Mejía","ANTERIOR $70","BP. 27638772 - 05-11-2024","PAGADO",0]
[{"$nulls":3},83,"San Sebastián","Raúl Tipán",0,"PASO DEUDA Y 1 DEP A JUEGOS","PAGADO",0]
[{"$nulls":3},84,"Scorpius","Dario Flores","ANTERIOR $70","Prd.389542020900-05-09-24","PAGADO",0]
[{"$nulls":3},85,"Seúl","Galo Garzón","ANTERIOR $65","1039095 - 27-12-2023 (1 jue N)","PAGADO",0]
[{"$nulls":3},86,"Seúl Capelo (Sucursal)","Fredy Castillo","ANTERIOR $50","BP. 44842339- 05-09-2024","PAGADO",0]
[{"$nulls":3},87,"Seúl Carapungo (Sucursal)","José Donoso","ANTERIOR $50","B.G.2285212-2-04-24","PAGADO",0]
[{"$nulls":3},88,"Seúl Yeong-Gu Carcelen","Brusby Muñoz","ANTERIOR $50","BP. 24853537 - 21-05-2024","PAGADO",0]
[{"$nulls":3},89,"Seúl Gedeon (Sucrusal)","José Luís Palacios","ANTERIOR $50","BG. 0009916524 - 18-03-2024","PAGADO",0]
[{"$nulls":3},90,"Seúl Chung UI (sucursal)","Juan Manuel Villacres","ANTERIOR $50","BP. 11085488 - 22-03-2024","PAGADO",0]
[{"$nulls":3},91,"Seúl Vale Todo Capapungo","Angél Vayas","ANTERIOR $50","BP. 93202077- 05-09-2024","PAGADO",0]
[{"$nulls":3},92,"Seúl La Salle","Angelica Guerrero","ANTERIOR $50","002-00015-22-05-2024","PAGADO",0]
[{"$nulls":3},93,"Shogun","Carlos Vélez","ANTERIOR $70","BP. 14359822 - 21-03-2024","PAGADO",0]
[{"$nulls":3},94,"Simjang Team Club de TKD","Marco Mogollon","ANTERIOR $270","03-01-2024 - 20218020","PAGADO",0]
[{"$nulls":3},95,"Suryun","Edison Gallardo","ANTERIOR $70","CANJE Y $ 20 BP. 138566834 19-08-2024","PAGADO",0]
[{"$nulls":3},96,"Tae  Baek  Junior","Edwin  Arteaga Jr.","ANTERIOR $70","BP. 141222211-11-11-2024","PAGADO",0]
[{"$nulls":3},97,"Tae Baek Junior Sucursal Solanda","Edwin  Arteaga Jr.",0,null,"PENDIENTE",{"v":50,"d":"$ 50.00"}]
[{"$nulls":3},98,"Tae Baek","Edwin Arteaga","ANTERIOR $70","BP. 51380759- 05-09-2024","PAGADO",0]
[{"$nulls":3},99,"Tae Kings","Jorge Astudillo S.","ANTERIOR $70","Pa. 4290202-14-10-2024","PAGADO",0]
[{"$nulls":3},100,"Tae Sho Ku","Marcelo Ochoa","ANTERIOR $70","BP. 29348779-26-06-2024","PAGADO",0]
[{"$nulls":3},101,"Tae Sho Ku","Gissela Estrella","ANTERIOR $50","B.P. 67213266-17-05-24","PAGADO",0]
[{"$nulls":3},102,"TaeDo","Vicente Lazcano","ANTERIOR $70","BP. 111358254- 05-09-2024","PAGADO",0]
[{"$nulls":3},103,"Taekwondo Trainig Center","Paúl Orellana","ANTERIOR $70","BG. 305852 - 12-03-2025","PAGADO",0]
[{"$nulls":3},104,"Taekwondo Jitae","Emperatriz Quinga","ANTERIOR $70","92326958 - 17-01-2024","PAGADO",0]
[{"$nulls":3},105,"Taekwondo Jucaro","Danilo Xavier Peréz","ANTERIOR $70","CANJE S. PROFESIONALES 03-02-2024 ($245)","PAGADO",0]
[{"$nulls":3},106,"Tae Woong","Patricia Tuqueres","ANTERIOR $70","DEPÓSITO","PAGADO",0]
[{"$nulls":3},107,"Team Tauro Taekwondo","José Chiriboga","ANTERIOR $70","982779 - 19-01-2024","PENDIENTE",{"v":150,"d":"$ 150.00"}]
[{"$nulls":3},108,"Team Vencedores","Victor Hugo Quishpe","ANTERIOR $70","BP. 52426968 - 14-10-2024","PAGADO",0]
[{"$nulls":3},109,"Tekken","Gustavo López","ANTERIOR $70","OFI. 3294433- 04-02-2024","PAGADO",0]
[{"$nulls":3},110,"Total Kombat","Raúl Aucancela","ANTERIOR $70","SALDO A FAVOR POR PAGO DE U. H. ","PAGADO",0]
[{"$nulls":3},111,"Total Kombat Rhinos Sucursal","Gustavo Llamuca","ANTERIOR $50","SALDO A FAVOR POR PAGO DE U. H. ","PAGADO",0]
[{"$nulls":3},112,"U San Francisco  USFQ","Carlos Reinoso","ANTERIOR $70","PASO DEUDA","PAGADO",0]
[{"$nulls":3},113,"Universal","Jorge Sisalema","ANTERIOR $70","EFECTIVO","PAGADO",0]
[{"$nulls":3},114,"Universidad Central (CAMU)","Anthony Rendón","ANTERIOR $70","BP. 209766626-18-09-2024","PAGADO",0]
[{"$nulls":3},115,"Universidad Hemisferios","Raúl Aucancela","ANTERIOR $267,3","BP.318788754-18/3/2024","PAGADO",0]
[{"$nulls":3},116,"Valle","Jorge Portilla",0,null,"PENDIENTE",{"v":140,"d":"$ 140.00"},"EN PROCESO DE DESAFILIACIÓN POR DEUDA"]
[{"$nulls":3},117,"Venom","Eddy Cajigal  K.","ANTERIOR $30","PRO.157300020900-1-10-24","PAGADO",0]
[{"$nulls":3},118,"Vill Gym","Hernán Villacis","ANTERIOR $70","BP. 7707848 - 22-01-2024","PAGADO",0]
[{"$nulls":3},119,"Yong Tiger","Wilson Rodríguez","ANTERIOR $70","DESCUENTO EN EVENTOS","PAGADO",0]
[{"$nulls":4},"TOTAL PAGOS SALDOS 2024",null,{"$f":"SUM(G11:G129)","v":{"v":70,"d":"$ 70.00"}},null,null,{"$f":"SUM(J11:J129)","v":{"v":390,"d":"$ 390.00"}},"POR COBRAR"]
[]
[]
[{"$nulls":4},"Se descuenta 5 USD por cada alumno que participe en Juegos Nacionales"]
[{"$nulls":4},"AFILIACIÓN NUEVO CLUB"]
[{"$nulls":4},"PERSMISO ANUAL DE FUNCIONAMIENTO"]
[{"$nulls":4},"REAFILIACIÓN"]
[]
[{"$nulls":4},"PAGOS DEL 16-03-2025 AL 05-09-2025"]

{"sheet":"AFILIACIONES Y PERMISOS 2025","index":2,"n_rows":147,"n_cols":11,"rows_kept":147,"merged":[[8,3,9,3],[8,6,9,6],[8,7,9,7],[8,8,9,8],[8,9,9,9],[138,4,138,5]]}
{"$rows_empty":8}
[{"$nulls":3},"N°","CLUBES FILIALES","FUNCIONAMIENTO 2023","PAGO","N° COMPROBANTE/FECHA","ESTADO","DEUDA"]
[{"$nulls":4},"CLUB","REPRESENTANTE"]
[{"$nulls":3},1,"Apolo","Mario Pinto",0,null,"PENDIENTE",{"v":70,"d":"$ 70.00"}]
[{"$nulls":3},2,"Apolo Sucursal ","Edison Gaullichico",{"v":50,"d":"$ 50.00"},"BP. 32347039 - 07-05-2025","PAGADO",0]
[{"$nulls":3},3,"Ares","Fernando Manosalvas",{"v":70,"d":"$ 70.00"},"BP. 33565169 - 13-05-2025","PAGADO",0]
[{"$nulls":3},4,"Ares (Sucursal San Francisco de Huarcay)","Fernando Manosalvas",{"v":60,"d":"$ 60.00"},"BP.42048196 - 13-05-2025","PAGADO",0]
[{"$nulls":3},5,"Atlas Club","Edgar Varela",{"v":70,"d":"$ 70.00"},"BP. 14244613 - 14-05-2025 ","PAGADO",0]
[{"$nulls":3},6,"BaekJul BG","Jorge Proaño","ANTERIOR $70","PAP. 3528183 - 16-01-2025","PAGADO",0]
[{"$nulls":3},7,"BaekJul Team AyalaZ (Sucursal)","Daniel Ayala","ANTERIOR $50","BP.13802498 - 14-01-2025 ","PAGADO",0]
[{"$nulls":3},8,"BaekJul Team Fernández (Sucursal)","Freddy Fernández","ANTERIOR $50","BP. 67130502- 08-10-2024","PAGADO",0]
[{"$nulls":3},9,"Bas Panthers","Jonatan Bastidas",0,null,"PENDIENTE",{"v":70,"d":"$ 70.00"}]
[{"$nulls":3},10,"Bas Panthers Pintag (Sucursal)","Jonatan Bastidas",0,null,"PENDIENTE",{"v":50,"d":"$ 50.00"}]
[{"$nulls":3},11,"Borja's Lions","Edgar Borja","ANTERIOR $70","BP. 53210770 - 08-02-2025","PAGADO",0]
[{"$nulls":3},12,"Blue Drangons","William Suntaxi",{"v":70,"d":"$ 70.00"},"BP. 37770529 - 09-04-2025","PAGADO",0]
[{"$nulls":3},13,"Ciudad de Quito","Fernando Jaramillo",{"v":70,"d":"$ 70.00"},"BP. 70238202 - 27-05-2025","PAGADO",0]
[{"$nulls":3},14,"Ciudad de Quito (Sucursal)","Adriana Obando",0,null,"PENDIENTE",{"v":50,"d":"$ 50.00"}]
[{"$nulls":3},15,"Condor","Efren Torres",0,null,"PENDIENTE",{"v":70,"d":"$ 70.00"}]
[{"$nulls":3},16,"Chen Huu","Pablo Cobos","ANTERIOR $70","BP. 165476447 24-02-2025","PAGADO",0]
[{"$nulls":3},17,"Chung Song","Carlos Morocho",{"v":70,"d":"$ 70.00"},"BP. 18792992 13-05-2025","PAGADO",0]
[{"$nulls":3},18,"Chonkwon","Christian Javier Huaraca  ",0,null,"PENDIENTE",{"v":70,"d":"$ 70.00"}]
[{"$nulls":3},19,"Champions For Life","Byron Berrones","ANTERIOR $65","BP.56940902 -04-02 2025 1 DEPORTISTA EN JJ. NN.","PAGADO",0]
[{"$nulls":3},20,"Daigoro","Edison Pérez V.",{"v":70,"d":"$ 70.00"},"BP. 150348368 12-05-2025","PAGADO",0]
[{"$nulls":3},21,"Daigoro Sector El Beaterio  (Sucursal)","Edison Pérez V.",0,null,"PENDIENTE",{"v":50,"d":"$ 50.00"}]
[{"$nulls":3},22,"Debak TKD","Jimmy Bolaños",{"v":40,"d":"$ 40.00"},"BP.77601967-14-03-2025 8 JJ. NN.","PAGADO",0]
[{"$nulls":3},23,"Debak TKD Colegio de Liga  (Sucursal)","Adrián Lara",{"v":50,"d":"$ 50.00"},"BP.77601967-14-03-2025 8 JJ. NN.","PAGADO",0]
[{"$nulls":3},24,"Debak TKD Carcelén Bajo (Sucursal)","Jared Vargas","ANTERIOR $50","BP. 61173349 - 07-03-2025","PAGADO",0]
[{"$nulls":3},25,"Deciap","Pablo Tayo",0,null,"CRUCE COLABORACIÓN CON SISTEMAS EN EVENTOS",0]
[{"$nulls":3},26,"Deciap Norte  (Sucursal)","Joel Mogollon",0,null,"PENDIENTE",{"v":50,"d":"$ 50.00"}]
[{"$nulls":3},27,"Dojang Taekwondo Melo","Vinicio Melo","ANTERIOR $70","BP. 22714106 - 06-03-2025","PAGADO",0]
[{"$nulls":3},28,"Draco","Edison Rodríguez",{"v":70,"d":"$ 70.00"},"BP. 197150488 - 18-08-2025","PAGADO",0]
[{"$nulls":3},29,"Dragon Gym","Miguel Aguas",{"v":70,"d":"$ 70.00"},"BP. 21113160 - 15-05-2025","PAGADO",0]
[{"$nulls":3},30,"Dragon Lee Gym","Edgar Lema","ANTERIOR $70","BP. 48960200- 16-01-2025","PAGADO",0]
[{"$nulls":3},31,"Ecuadcuba/ Black Panthers","Eddy Cajigal  Kindelan",0,null,"PENDIENTE",{"v":70,"d":"$ 70.00"}]
[{"$nulls":3},32,"Ecuador ","Jorge Astudillo","ANTERIOR $70","BP. 41631917- 08-01-2025","PAGADO",0]
[{"$nulls":3},33,"Equilibrio","Juan Valencia","ANTERIOR $70","BR.826500- 27-01-2025","PAGADO",0]
[{"$nulls":3},34,"ESPE","Eduardo Loachamín",{"v":70,"d":"$ 70.00"},"CRUCE DE CUENTAS","PAGADO",0]
[{"$nulls":3},36,"Farang","Mesias Rojas",0,null,"PENDIENTE",{"v":70,"d":"$ 70.00"}]
[{"$nulls":3},37,"Fitt kwon do","Galo Garzón ",0,null,"PENDIENTE",{"v":70,"d":"$ 70.00"}]
[{"$nulls":3},38,"First Class Calderon","Lenin Plazarte","ANTERIOR $50","BP. 223594331 - 12-08-2024","PENDIENTE",{"v":20,"d":"$ 20.00"}]
[{"$nulls":3},39,"Furia Negra","Franklin Caiza",{"v":70,"d":"$ 70.00"},"BP. 61724020 - 14-03-2025","PAGADO",0]
[{"$nulls":3},40,"Grand Master ","César Tayo",0,"SE ACUERDA COMPROMISO DE PAGO POR APOYO EN EVENTOS","PENDIENTE",{"v":70,"d":"$ 70.00"}]
[{"$nulls":3},41,"Goyang - Ideul","Luis Elias Pisuña",0,null,"PENDIENTE",{"v":70,"d":"$ 70.00"}]
[{"$nulls":3},42,"Han Su","Mauricio Valladares",{"v":70,"d":"$ 70.00"},"EFECTIVO 23-03-2025","PAGADO",0]
[{"$nulls":3},43,"Han Kum Do","Nicole Tapia","ANTERIOR $70","BG. 0000350660-13-01-2025","PENDIENTE",{"v":200,"d":"$ 200.00"}]
[{"$nulls":3},44,"Himchari Dojang","Claudia Cárdenas",{"v":70,"d":"$ 70.00"},"BP. 62940748 - 10-05-2025","PAGADO",0]
[{"$nulls":3},45,"Huang Top Gym","Guido Mejia",{"v":70,"d":"$ 70.00"},"PRO.604973020900-23-04-25","PAGADO",0]
[{"$nulls":3},46,"Ilyo MP","Miguel Parra",0,null,"PENDIENTE",{"v":70,"d":"$ 70.00"}]
[{"$nulls":3},47,"Ji Do Kwan","David Del Castillo",{"v":70,"d":"$ 70.00"},"PRO. 288744020900-10-05-25","PAGADO",0]
[{"$nulls":3},48,"Joseon Legacy","Fernando Moya",0,null,"PENDIENTE",{"v":70,"d":"$ 70.00"}]
[{"$nulls":3},49,"JR Sport","Juan Carlos Ramírez",0,null,"PENDIENTE",{"v":70,"d":"$ 70.00"}]
[{"$nulls":3},50,"Juventus","Jhony Pavón",0,null,"PENDIENTE",{"v":70,"d":"$ 70.00"}]
[{"$nulls":3},51,"Jerathel","Samantha Mogollon","ANTERIOR $70","BP. 12782374 - 28-01-2024","PAGADO",0]
[{"$nulls":3},52,"Jerathel Armenia","Samantha Mogollon",{"v":50,"d":"$ 50.00"},"BP. 15683593 - 07-05-2025"]
[{"$nulls":3},53,"Ko América","Miguel Angél Pavón","ANTERIOR $65","BP.13888302-07-01-2024 1 DEPORTISTA EN JJ. NN.","PAGADO",0]
[{"$nulls":3},54,"Ko América Caupicho  (Sucursal)","Bryan Chalcualan",{"v":50,"d":"$ 50.00"},"BP. 53143581 - 10-04-2025","PAGADO",0]
[{"$nulls":3},55,"Ko América Santo Tomas  (Sucursal)","Bryan Chalcualan",{"v":50,"d":"$ 50.00"},"BP. 53143581 - 10-04-2025","PAGADO",0]
[{"$nulls":3},56,"Ko América Dragon de Fuego  (Sucursal)","Luis Sandoval",0,null,"PENDIENTE",{"v":50,"d":"$ 50.00"}]
[{"$nulls":3},57,"Korean Dragon","Fabián Moreno",{"v":35,"d":"$ 35.00"},"BP. 16157592 - 31-07-2025","PAGADO",{"v":35,"d":"$ 35.00"}]
[{"$nulls":3},58,"Koryo","Guillermo Puga - Sharon López",0,null,"PENDIENTE",{"v":70,"d":"$ 70.00"}]
[{"$nulls":3},59,"Koryo Sucursal","Guillermo Puga - Sharon López",0,null,"PENDIENTE",{"v":50,"d":"$ 50.00"}]
[{"$nulls":3},61,"Kukkiwon","David Chicaiza",{"v":70,"d":"$ 70.00"},"BP. 7223712 - 14-05-2025","PAGADO",0]
[{"$nulls":3},62,"Kumgan Dul","Fabián García",0,null,"PENDIENTE",{"v":70,"d":"$ 70.00"}]
[{"$nulls":3},63,"Kyorugui Gym","Vinicio Cardona",{"v":70,"d":"$ 70.00"},"EFECTIVO 13-05-2025 ","PAGADO",0]
[{"$nulls":3},64,"León","Romel  Pilaquinga",{"v":70,"d":"$ 70.00"},"BP. 32732187- 12-05-2025","PAGADO",0]
[{"$nulls":3},65,"León (Sucursal Norte)","Ian Catota","ANTERIOR $50","BP. 15791114 - 14-01-2024","PAGADO",0]
[{"$nulls":3},66,"Liga Deportiva Cantonal Mejía","Vladimir Viana",{"v":70,"d":"$ 70.00"},"BP. 115743057 - 19-05-2025","PENDIENTE",{"v":70,"d":"$ 70.00"}]
[{"$nulls":3},67,"Lithe body","Norma Ortíz ",{"v":70,"d":"$ 70.00"},"BP. 14550841- 17-07-2025","PAGADO",0]
[{"$nulls":3},68,"Lobos","Cristian Flores",0,null,"PENDIENTE",{"v":70,"d":"$ 70.00"}]
[{"$nulls":3},69,"Los Pumas","Galo Gavilanez",{"v":70,"d":"$ 70.00"},"BP. 5161256- 12-05-2025","PAGADO",0]
[{"$nulls":3},70,"Master Home","Marlon Lema",0,null,"PENDIENTE",{"v":70,"d":"$ 70.00"}]
[{"$nulls":3},71,"Marcial Club Granda","Luis Granda",{"v":70,"d":"$ 70.00"},"BP. 3172970- 12-05-2025","PAGADO",0]
[{"$nulls":3},72,"Mercenarios","Luis Cano",0,null,"PENDIENTE",{"v":70,"d":"$ 70.00"}]
[{"$nulls":3},73,"Mikido","Daniel Guerra","ANTERIOR $70","BP. 32299486 - 06-02-2025","PAGADO",0]
[{"$nulls":3},74,"Millenium","Jean Galora",0,null,"PENDIENTE",{"v":70,"d":"$ 70.00"}]
[{"$nulls":3},75,"Michay","Luisa Vega","ANTERIOR $70","BP. 88911303 - 24-02-2025","PAGADO",0]
[{"$nulls":3},76,"Minotaurus","Marco Duchi","ANTERIOR $70","BP. 7688068 - 11-03-2025","PAGADO",0]
[{"$nulls":3},77,"Mit-TKD","Mellany Inasunta","ANTERIOR $70","BP. 83102853 - 05-03-2025","PAGADO",0]
[{"$nulls":3},78,"Paladins","Jeann Paladines",{"v":70,"d":"$ 70.00"},"BP. 14824398- 14-03-2025","PAGADO",0]
[{"$nulls":3},79,"Pandademon","Andrés Herrera",0,null,"PENDIENTE",{"v":70,"d":"$ 70.00"}]
[{"$nulls":3},80,"Pionero Fortis","Xavier Moreira Fortis",{"v":70,"d":"$ 70.00"},"BP. 6060495- 29-07-2025","PAGADO",0]
[{"$nulls":3},81,"Pionero Mejía","Luís Burbano","ANTERIOR $70","BG. 0000519175-06-02-2025","PAGADO",0]
[{"$nulls":3},82,"Pyongyang","Luisa Vega","ANTERIOR $70","BP. 88911303 - 24-02-2025","PAGADO",0]
[{"$nulls":3},83,"Raig de llum","Fernando Ruiz",{"v":70,"d":"$ 70.00"},"BP. 41798746 - 09-05-2025","PAGADO",0]
[{"$nulls":3},84,"Tanaka Red","Carlos Estrella","ANTERIOR $70","PRO. 675070 - 15-01-2025 ","PAGADO",0]
[{"$nulls":3},85,"Renacer","Milton Ramos","ANTERIOR $70","PA. 8714977 - 25-02-2025","PAGADO",0]
[{"$nulls":3},86,"Ryong Tae","Diego Merino",{"v":100,"d":"$ 100.00"},"EFECTIVO 10-05-2025","PAGADO",0]
[{"$nulls":3},87,"Rojas Iron First","Jorge Rojas",0,null,"PENDIENTE",{"v":70,"d":"$ 70.00"}]
[{"$nulls":3},88,"S. D. Central","Carlos Reinoso",{"v":60,"d":"$ 60.00"},"EFECTIVO 13-05-2025 2 DEP EN JJ. NN.","PENDIENTE",0]
[{"$nulls":3},89,"S. D. Central Carapungo (Sucursal)","Guillermo Morán","ANTERIOR $50","BP. 155411989 - 11-03-2025","PAGADO",0]
[{"$nulls":3},90,"San Francisco Tigres","Carlos Mejía",{"v":40,"d":"$ 40.00"},"BP. 23267039 - 08-07-2025","PENDIENTE",{"v":30,"d":"$ 30.00"}]
[{"$nulls":3},91,"San Sebastián","Raúl Tipán","ANTERIOR $60","BP.110817481 -10-03-2025 2 DEPORTISTAS EN JJ. NN.","PAGADO",0]
[{"$nulls":3},92,"Sabonim","Esteban Altamirano",{"v":70,"d":"$ 70.00"},"BP. 37483412 - 16-05-2025","PENDIENTE",{"v":200,"d":"$ 200.00"}]
[{"$nulls":3},93,"Scorpius","Dario Flores",0,null,"PENDIENTE",{"v":70,"d":"$ 70.00"}]
[{"$nulls":3},94,"Seúl","Galo Garzón",{"v":70,"d":"$ 70.00"},"BI. 7639939 - 12-05-2025","PAGADO",0]
[{"$nulls":3},95,"Seúl Capelo (Sucursal)","Fredy Castillo",0,null,"PENDIENTE",{"v":50,"d":"$ 50.00"}]
[{"$nulls":3},96,"Seúl Carapungo (Sucursal)","José Donoso",0,null,"PENDIENTE",{"v":50,"d":"$ 50.00"}]
[{"$nulls":3},97,"Seúl Yeong-Gu Carcelen","Brusby Muñoz",0,null,"PENDIENTE",{"v":50,"d":"$ 50.00"}]
[{"$nulls":3},98,"Seúl Gedeon (Sucursal)","José Luís Palacios",0,null,"PENDIENTE",{"v":50,"d":"$ 50.00"}]
[{"$nulls":3},99,"Seúl Chung UI (sucursal)","Juan Manuel Villacres",{"v":50,"d":"$ 50.00"},"PRO. 866797020900-12-05-2025","PAGADO",0]
[{"$nulls":3},100,"Seúl Vale Todo Capapungo","Angél Vayas",{"v":50,"d":"$ 50.00"},"BP. 76576064 - 16-05-2025","PAGADO",0]
[{"$nulls":3},102,"Shogun","Carlos Vélez","ANTERIOR $70","BP. 75401887 - 17-02-2025","PAGADO",0]
[{"$nulls":3},103,"Simjang Team Club de TKD","Marco Mogollon","ANTERIOR $70","BP. 12570316 - 28-01-2025","PAGADO",0]
[{"$nulls":3},104,"Suryun","Edison Gallardo",{"v":70,"d":"$ 70.00"},"BP. 799141383286-10-05-2025","PAGADO",0]
[{"$nulls":3},105,"Tae  Baek  Junior","Edwin  Arteaga Jr.",0,null,"PENDIENTE",{"v":70,"d":"$ 70.00"}]
[{"$nulls":3},106,"Tae Baek Junior Sucursal Solanda","Edwin  Arteaga Jr.",0,null,"PENDIENTE",{"v":50,"d":"$ 50.00"}]
[{"$nulls":3},107,"Tae Baek","Edwin Arteaga","ANTERIOR $70","BP. 2670551 - 28-01-2025","PAGADO",0]
[{"$nulls":3},108,"Tae Kings","Jorge Astudillo S.",0,null,"PENDIENTE",{"v":70,"d":"$ 70.00"}]
[{"$nulls":3},109,"Tae Sho Ku","Marcelo Ochoa",{"v":65,"d":"$ 65.00"},"BP. 6832330- 10-05-2025 1 jue","PAGADO",0]
[{"$nulls":3},110,"Tae Sho Ku Team Valle (Sucursal)","Gissela Estrella",0,null,"PENDIENTE",{"v":50,"d":"$ 50.00"}]
[{"$nulls":3},111,"TaeDo","Vicente Lascano",{"v":70,"d":"$ 70.00"},"BP. 27131636 - 14-05-2025","PAGADO",0]
[{"$nulls":3},112,"Moodukkwan Trainig Center","Paúl Orellana","ANTERIOR $70","BG. 305852 - 12-03-2025","PAGADO",0]
[{"$nulls":3},113,"Moodukkwan HSTKD","Henry Sigchos",{"v":50,"d":"$ 50.00"},"BP. 51192594 - 21-03-2025 Y BP. 224008468 - 05-05-2025","PAGADO",0]
[{"$nulls":3},114,"Taekwondo Jitae","Emperatriz Quinga",{"v":70,"d":"$ 70.00"},"BP.  129270870 - 12-05-2025 $10 EN EFECTIVO","PAGADO",0]
[{"$nulls":3},115,"Taekwondo Jucaro","Danilo Xavier Peréz",{"v":70,"d":"$ 70.00"},"PRO. 743290020900-12-05-2025","PAGADO",0]
[{"$nulls":3},116,"Tae Woong","Patricia Túqueres",{"v":70,"d":"$ 70.00"},"BP.  24063891 - 18-06-2025","PAGADO",0]
[{"$nulls":3},117,"Tae Woong Pomasqui","Sara Túqueres",{"v":50,"d":"$ 50.00"},"BP.  69103048 - 25-03-2025","PAGADO",0]
[{"$nulls":3},118,"Team Tauro Taekwondo","José Chiriboga",0,null,"PENDIENTE",{"v":220,"d":"$ 220.00"}]
[{"$nulls":3},119,"Team Vencedores","Victor Hugo Quishpe",0,null,"PENDIENTE",{"v":70,"d":"$ 70.00"}]
[{"$nulls":3},120,"Tekken","Gustavo López","ANTERIOR $70","PA. 7152417 - 13-01-2025","PAGADO",0]
[{"$nulls":3},121,"Total Kombat","Raúl Aucancela",{"v":30,"d":"$ 30.00"},"$ 40 A FAVOR TRÁMITE 10-12-2024 Y 30 EFECTIVO 12-05-2025","PAGADO",0]
[{"$nulls":3},122,"Total Kombat Rhinos Sucursal","Gustavo Llamuca",{"v":50,"d":"$ 50.00"},"BP. 38927522 - 12-05-2025","PAGADO",0]
[{"$nulls":3},123,"Total Kombat Cobra Kay","Raúl Aucancela","ANTERIOR $50","BP. 38627760 - 10-03-2025","PAGADO",0]
[{"$nulls":3},124,"Total Kombat - Kukkiwon CC.","Carlos Chicaiza",{"v":50,"d":"$ 50.00"},"BP. 47387990 - 06-05-2025","PAGADO",0]
[{"$nulls":3},125,"U. San Francisco  USFQ","Carlos Reinoso",0,null,"PENDIENTE",{"v":70,"d":"$ 70.00"}]
[{"$nulls":3},126,"Universal","Jorge Sisalema","ANTERIOR $70","PA. 3309797 - 27-02-2025","PAGADO",0]
[{"$nulls":3},127,"Universidad Central (CAMU)","Anthony Rendón",{"v":70,"d":"$ 70.00"},"BP. 27164909 - 14-05-2025","PAGADO",0]
[{"$nulls":3},129,"Universidad UTE","Adriana Obando","ANTERIOR $262,57","BP. 11052417 - 28-01-2025","PAGADO",0]
[{"$nulls":3},130,"Venom","Eddy Cajigal  K.",{"v":20,"d":"$ 20.00"},"PRO. 908440 - 06-03-2025 / PRO. 685763020900 - 02-04-2025","PENDIENTE",{"v":24,"d":"$ 24.00"}]
[{"$nulls":3},131,"Vill Gym","Hernán Villacis",{"v":70,"d":"$ 70.00"},"BP. 42347021 - 06-05-2025","PAGADO",0]
[{"$nulls":3},132,"Yong Tiger","Wilson Rodríguez",0,null,"PENDIENTE",{"v":70,"d":"$ 70.00"}]
[{"$nulls":4},"TOTAL PAGOS 2025",null,{"$f":"SUM(G11:G138)","v":{"v":3310,"d":"$ 3,310.00"}},null,null,{"$f":"SUM(J11:J138)","v":{"v":3289,"d":"$ 3,289.00"}},"POR COBRAR"]
[]
[{"$nulls":6},"EFECTIVO",{"$f":"G51+G71+G94+G96+10+G128","v":{"v":340,"d":"340.00"}}]
[{"$nulls":4},"Se descuenta 5 USD por cada alumno que participe en Juegos Nacionales"]
[{"$nulls":4},"AFILIACIÓN NUEVO CLUB"]
[{"$nulls":4},"PERSMISO ANUAL DE FUNCIONAMIENTO"]
[{"$nulls":4},"REAFILIACIÓN"]
[]
[{"$nulls":4},"PAGOS DEL 16-03-2025 AL 05-09-2025"]

{"sheet":"GAL'S 2025 ","index":3,"n_rows":1580,"n_cols":11,"rows_kept":1580,"merged":[[0,5,0,6],[1,0,1,10],[55,10,56,10],[78,10,79,10],[108,10,110,10],[111,10,113,10],[117,10,118,10],[133,10,134,10]]}
[]
["LICENCIAS DE COMPETIDOR (16 DE MARZO 2025 AL 05 SEPTIEMBRE 2025)"]
["FECHA","CLUB","CANT.","PRECIO UNITARIO","VALOR A PAGAR","EFECTIVO","TRANSFERENCIA","VALOR CANCELADO","ESTADO","SALDO","OBSERVACIONES"]
["2025-03-17","TAEGUK JUCARO",2,{"v":2,"d":"$ 2.00"},{"$f":"C4*Tabla1442[[#This Row],[PRECIO UNITARIO]]","v":{"v":4,"d":"$ 4.00"}},0,{"v":4,"d":"$ 4.00"},{"$f":"F4+G4","v":{"v":4,"d":"$ 4.00"}},{"$f":"IF((E4=H4),\"CANCELADO\",\"SALDO PENDIENTE\")","v":"CANCELADO"},{"$f":"Tabla1442[[#This Row],[VALOR A PAGAR]]-Tabla1442[[#This Row],[VALOR CANCELADO]]","v":0},"IMPRESIÓN CARNETS DE ENTRENADOR"]
["2025-03-20","UTE",7,{"v":8,"d":"$ 8.00"},{"$f":"C5*Tabla1442[[#This Row],[PRECIO UNITARIO]]","v":{"v":56,"d":"$ 56.00"}},0,{"v":56,"d":"$ 56.00"},{"v":56,"d":"$ 56.00"},"CANCELADO",{"$f":"Tabla1442[[#This Row],[VALOR A PAGAR]]-Tabla1442[[#This Row],[VALOR CANCELADO]]","v":0}]
["2025-03-20","HANSU",7,{"v":8,"d":"$ 8.00"},{"$f":"C6*Tabla1442[[#This Row],[PRECIO UNITARIO]]","v":{"v":56,"d":"$ 56.00"}},0,{"v":56,"d":"$ 56.00"},{"v":56,"d":"$ 56.00"},"CANCELADO",{"$f":"Tabla1442[[#This Row],[VALOR A PAGAR]]-Tabla1442[[#This Row],[VALOR CANCELADO]]","v":0}]
["2025-03-21","GOYANG - IDEUL",3,{"v":8,"d":"$ 8.00"},{"$f":"C7*Tabla1442[[#This Row],[PRECIO UNITARIO]]","v":{"v":24,"d":"$ 24.00"}},0,{"v":24,"d":"$ 24.00"},{"v":24,"d":"$ 24.00"},"CANCELADO",{"$f":"Tabla1442[[#This Row],[VALOR A PAGAR]]-Tabla1442[[#This Row],[VALOR CANCELADO]]","v":0}]
["2025-03-21","CIUDAD DE QUITO",2,{"v":8,"d":"$ 8.00"},{"$f":"C8*Tabla1442[[#This Row],[PRECIO UNITARIO]]","v":{"v":16,"d":"$ 16.00"}},0,{"v":16,"d":"$ 16.00"},{"v":16,"d":"$ 16.00"},"CANCELADO",{"$f":"Tabla1442[[#This Row],[VALOR A PAGAR]]-Tabla1442[[#This Row],[VALOR CANCELADO]]","v":0}]
["2025-03-21","DRAGON GYM",2,{"v":8,"d":"$ 8.00"},{"$f":"C9*Tabla1442[[#This Row],[PRECIO UNITARIO]]","v":{"v":16,"d":"$ 16.00"}},0,{"v":16,"d":"$ 16.00"},{"v":16,"d":"$ 16.00"},"CANCELADO",{"$f":"Tabla1442[[#This Row],[VALOR A PAGAR]]-Tabla1442[[#This Row],[VALOR CANCELADO]]","v":0},"CANCELA CON  34 CERTIFICADOS DE ASCENSO"]
["2025-03-24","TAEBAEK ECUADOR",1,{"v":8,"d":"$ 8.00"},{"$f":"C10*Tabla1442[[#This Row],[PRECIO UNITARIO]]","v":{"v":8,"d":"$ 8.00"}},0,{"v":8,"d":"$ 8.00"},{"v":8,"d":"$ 8.00"},"CANCELADO",{"$f":"Tabla1442[[#This Row],[VALOR A PAGAR]]-Tabla1442[[#This Row],[VALOR CANCELADO]]","v":0}]
["2025-03-25","SHOGUN",10,{"v":6,"d":"$ 6.00"},{"$f":"C11*Tabla1442[[#This Row],[PRECIO UNITARIO]]","v":{"v":60,"d":"$ 60.00"}},0,{"v":60,"d":"$ 60.00"},{"v":60,"d":"$ 60.00"},"CANCELADO",{"$f":"Tabla1442[[#This Row],[VALOR A PAGAR]]-Tabla1442[[#This Row],[VALOR CANCELADO]]","v":0}]
["2025-03-25","FARANG",1,{"v":8,"d":"$ 8.00"},{"$f":"C12*Tabla1442[[#This Row],[PRECIO UNITARIO]]","v":{"v":8,"d":"$ 8.00"}},0,{"v":8,"d":"$ 8.00"},{"v":8,"d":"$ 8.00"},"CANCELADO",{"$f":"Tabla1442[[#This Row],[VALOR A PAGAR]]-Tabla1442[[#This Row],[VALOR CANCELADO]]","v":0}]
["2025-03-26","SOCIEDAD DEPORTIVA CENTRAL",1,{"v":8,"d":"$ 8.00"},{"$f":"C13*Tabla1442[[#This Row],[PRECIO UNITARIO]]","v":{"v":8,"d":"$ 8.00"}},{"v":8,"d":"$ 8.00"},0,{"v":8,"d":"$ 8.00"},"CANCELADO",{"$f":"Tabla1442[[#This Row],[VALOR A PAGAR]]-Tabla1442[[#This Row],[VALOR CANCELADO]]","v":0}]
["2025-03-27","BAEKJUL TEAM AYALAZ",4,{"v":8,"d":"$ 8.00"},{"$f":"C14*Tabla1442[[#This Row],[PRECIO UNITARIO]]","v":{"v":32,"d":"$ 32.00"}},0,{"v":32,"d":"$ 32.00"},{"v":32,"d":"$ 32.00"},"CANCELADO",{"$f":"Tabla1442[[#This Row],[VALOR A PAGAR]]-Tabla1442[[#This Row],[VALOR CANCELADO]]","v":0},"CANCELA CON  3 CERTIFICADOS DE ASCENSO"]
["2025-03-25","LEÓN",6,{"v":2,"d":"$ 2.00"},{"$f":"C15*Tabla1442[[#This Row],[PRECIO UNITARIO]]","v":{"v":12,"d":"$ 12.00"}},{"v":12,"d":"$ 12.00"},0,{"v":12,"d":"$ 12.00"},"CANCELADO",{"$f":"Tabla1442[[#This Row],[VALOR A PAGAR]]-Tabla1442[[#This Row],[VALOR CANCELADO]]","v":0},"SOLO IMPRESIÓN DE 6 GAL'S DIGITALES"]
["2025-03-25","LEÓN",1,{"v":8,"d":"$ 8.00"},{"$f":"C16*Tabla1442[[#This Row],[PRECIO UNITARIO]]","v":{"v":8,"d":"$ 8.00"}},{"v":8,"d":"$ 8.00"},0,{"v":8,"d":"$ 8.00"},"CANCELADO",{"$f":"Tabla1442[[#This Row],[VALOR A PAGAR]]-Tabla1442[[#This Row],[VALOR CANCELADO]]","v":0},"ENVÍA DATOS PARA TRÁMITE EL 07-05-2025"]
["2025-03-26","SEUL GEDEON",2,{"v":8,"d":"$ 8.00"},{"$f":"C17*Tabla1442[[#This Row],[PRECIO UNITARIO]]","v":{"v":16,"d":"$ 16.00"}},{"v":16,"d":"$ 16.00"},0,{"v":16,"d":"$ 16.00"},"CANCELADO",{"$f":"Tabla1442[[#This Row],[VALOR A PAGAR]]-Tabla1442[[#This Row],[VALOR CANCELADO]]","v":0}]
["2025-03-26","SEUL GEDEON",1,{"v":2,"d":"$ 2.00"},{"$f":"C18*Tabla1442[[#This Row],[PRECIO UNITARIO]]","v":{"v":2,"d":"$ 2.00"}},{"v":2,"d":"$ 2.00"},0,{"v":2,"d":"$ 2.00"},"CANCELADO",{"$f":"Tabla1442[[#This Row],[VALOR A PAGAR]]-Tabla1442[[#This Row],[VALOR CANCELADO]]","v":0},"DEPORTISTA CON CAPACIDADES ESPECIALES"]
["2025-03-31","MIKIDO",16,{"v":8,"d":"$ 8.00"},{"$f":"C19*Tabla1442[[#This Row],[PRECIO UNITARIO]]","v":{"v":128,"d":"$ 128.00"}},0,{"v":128,"d":"$ 128.00"},{"v":128,"d":"$ 128.00"},"CANCELADO",{"$f":"Tabla1442[[#This Row],[VALOR A PAGAR]]-Tabla1442[[#This Row],[VALOR CANCELADO]]","v":0},"CANCELA CON  20 CERTIFICADOS DE ASCENSO"]
["2025-04-01","ECUADOR",2,{"v":6,"d":"$ 6.00"},{"$f":"C20*Tabla1442[[#This Row],[PRECIO UNITARIO]]","v":{"v":12,"d":"$ 12.00"}},0,{"v":12,"d":"$ 12.00"},{"v":12,"d":"$ 12.00"},"CANCELADO",{"$f":"Tabla1442[[#This Row],[VALOR A PAGAR]]-Tabla1442[[#This Row],[VALOR CANCELADO]]","v":0},"CANCELA CON  18 CERTIFICADOS DE ASCENSO"]
["2025-04-02","VENOM",9,{"v":6,"d":"$ 6.00"},{"$f":"C21*Tabla1442[[#This Row],[PRECIO UNITARIO]]","v":{"v":54,"d":"$ 54.00"}},0,{"v":54,"d":"$ 54.00"},{"v":54,"d":"$ 54.00"},"CANCELADO",{"$f":"Tabla1442[[#This Row],[VALOR A PAGAR]]-Tabla1442[[#This Row],[VALOR CANCELADO]]","v":0},"CANCELA EN DOS PAGOS Y CON ABONO POR PERMISO DE FUNCIONAMIENTO"]
["2025-04-02","TAE SHO KU",3,{"v":8,"d":"$ 8.00"},{"$f":"C22*Tabla1442[[#This Row],[PRECIO UNITARIO]]","v":{"v":24,"d":"$ 24.00"}},0,{"v":24,"d":"$ 24.00"},{"v":24,"d":"$ 24.00"},"CANCELADO",{"$f":"Tabla1442[[#This Row],[VALOR A PAGAR]]-Tabla1442[[#This Row],[VALOR CANCELADO]]","v":0}]
["2025-04-03","SOCIEDAD DEPORTIVA CENTRAL",1,{"v":8,"d":"$ 8.00"},{"$f":"C23*Tabla1442[[#This Row],[PRECIO UNITARIO]]","v":{"v":8,"d":"$ 8.00"}},{"v":8,"d":"$ 8.00"},0,{"v":8,"d":"$ 8.00"},"CANCELADO",{"$f":"Tabla1442[[#This Row],[VALOR A PAGAR]]-Tabla1442[[#This Row],[VALOR CANCELADO]]","v":0}]
["2025-04-04","BORJA'S LIONS",25,{"v":6,"d":"$ 6.00"},{"$f":"C24*Tabla1442[[#This Row],[PRECIO UNITARIO]]","v":{"v":150,"d":"$ 150.00"}},0,{"v":150,"d":"$ 150.00"},{"v":150,"d":"$ 150.00"},"CANCELADO",{"$f":"Tabla1442[[#This Row],[VALOR A PAGAR]]-Tabla1442[[#This Row],[VALOR CANCELADO]]","v":0},"CANCELA CON  25 CERTIFICADOS DE ASCENSO"]
["2025-04-07","ASOTKD - P (CHIMBACALLE)",8,{"v":8,"d":"$ 8.00"},{"$f":"C25*Tabla1442[[#This Row],[PRECIO UNITARIO]]","v":{"v":64,"d":"$ 64.00"}},{"v":64,"d":"$ 64.00"},0,{"v":64,"d":"$ 64.00"},"CANCELADO",{"$f":"Tabla1442[[#This Row],[VALOR A PAGAR]]-Tabla1442[[#This Row],[VALOR CANCELADO]]","v":0}]
["2025-04-07","SEUL",2,{"v":8,"d":"$ 8.00"},{"$f":"C26*Tabla1442[[#This Row],[PRECIO UNITARIO]]","v":{"v":16,"d":"$ 16.00"}},0,{"v":16,"d":"$ 16.00"},{"v":16,"d":"$ 16.00"},"CANCELADO",{"$f":"Tabla1442[[#This Row],[VALOR A PAGAR]]-Tabla1442[[#This Row],[VALOR CANCELADO]]","v":0}]
["2025-04-07","ASOTKD - P (VICENTINA)",2,{"v":8,"d":"$ 8.00"},{"$f":"C27*Tabla1442[[#This Row],[PRECIO UNITARIO]]","v":{"v":16,"d":"$ 16.00"}},{"v":16,"d":"$ 16.00"},null,{"v":16,"d":"$ 16.00"},"CANCELADO",{"$f":"Tabla1442[[#This Row],[VALOR A PAGAR]]-Tabla1442[[#This Row],[VALOR CANCELADO]]","v":0}]
["2025-04-08","TAE WOONG",10,{"v":8,"d":"$ 8.00"},{"$f":"C28*Tabla1442[[#This Row],[PRECIO UNITARIO]]","v":{"v":80,"d":"$ 80.00"}},0,{"v":80,"d":"$ 80.00"},{"v":80,"d":"$ 80.00"},"CANCELADO",{"$f":"Tabla1442[[#This Row],[VALOR A PAGAR]]-Tabla1442[[#This Row],[VALOR CANCELADO]]","v":0},"CANCELA CON  2 CERTIFICADOS DE ASCENSO"]
["2025-04-08","TAE WOONG",1,{"v":2,"d":"$ 2.00"},{"$f":"C29*Tabla1442[[#This Row],[PRECIO UNITARIO]]","v":{"v":2,"d":"$ 2.00"}},0,{"v":2,"d":"$ 2.00"},{"v":2,"d":"$ 2.00"},"CANCELADO",{"$f":"Tabla1442[[#This Row],[VALOR A PAGAR]]-Tabla1442[[#This Row],[VALOR CANCELADO]]","v":0},"CANCELA CON  2 CERTIFICADOS DE ASCENSO"]
["2025-04-09","KUMGANG DUL",4,{"v":6,"d":"$ 6.00"},{"$f":"C30*Tabla1442[[#This Row],[PRECIO UNITARIO]]","v":{"v":24,"d":"$ 24.00"}},0,{"v":24,"d":"$ 24.00"},{"v":24,"d":"$ 24.00"},"CANCELADO",{"$f":"Tabla1442[[#This Row],[VALOR A PAGAR]]-Tabla1442[[#This Row],[VALOR CANCELADO]]","v":0},"PARA EMISIÓN DE CERTIFICADOS DE ASCENSO 2024"]
["2025-04-09","KUMGANG DUL",1,{"v":8,"d":"$ 8.00"},{"$f":"C31*Tabla1442[[#This Row],[PRECIO UNITARIO]]","v":{"v":8,"d":"$ 8.00"}},0,{"v":8,"d":"$ 8.00"},{"v":8,"d":"$ 8.00"},"CANCELADO",{"$f":"Tabla1442[[#This Row],[VALOR A PAGAR]]-Tabla1442[[#This Row],[VALOR CANCELADO]]","v":0}]
["2025-04-09","CAMU",12,{"v":8,"d":"$ 8.00"},{"$f":"C32*Tabla1442[[#This Row],[PRECIO UNITARIO]]","v":{"v":96,"d":"$ 96.00"}},0,{"v":96,"d":"$ 96.00"},{"v":96,"d":"$ 96.00"},"CANCELADO",{"$f":"Tabla1442[[#This Row],[VALOR A PAGAR]]-Tabla1442[[#This Row],[VALOR CANCELADO]]","v":0},"SOLICITA CON 20 CERTIFICADOS DE ASCENSO"]
["2025-04-10","KO AMÉRICA",25,{"v":6,"d":"$ 6.00"},{"$f":"C33*Tabla1442[[#This Row],[PRECIO UNITARIO]]","v":{"v":150,"d":"$ 150.00"}},0,{"v":150,"d":"$ 150.00"},{"v":150,"d":"$ 150.00"},"CANCELADO",{"$f":"Tabla1442[[#This Row],[VALOR A PAGAR]]-Tabla1442[[#This Row],[VALOR CANCELADO]]","v":0}]
["2025-04-11","KUKKIWON",2,{"v":8,"d":"$ 8.00"},{"$f":"C34*Tabla1442[[#This Row],[PRECIO UNITARIO]]","v":{"v":16,"d":"$ 16.00"}},0,{"v":16,"d":"$ 16.00"},{"v":16,"d":"$ 16.00"},"CANCELADO",{"$f":"Tabla1442[[#This Row],[VALOR A PAGAR]]-Tabla1442[[#This Row],[VALOR CANCELADO]]","v":0}]
["2025-04-14","JIDOKWAN",1,{"v":8,"d":"$ 8.00"},{"$f":"C35*Tabla1442[[#This Row],[PRECIO UNITARIO]]","v":{"v":8,"d":"$ 8.00"}},0,{"v":8,"d":"$ 8.00"},{"v":8,"d":"$ 8.00"},"CANCELADO",{"$f":"Tabla1442[[#This Row],[VALOR A PAGAR]]-Tabla1442[[#This Row],[VALOR CANCELADO]]","v":0}]
["2025-04-14","KYORUGUI GYM",2,{"v":6,"d":"$ 6.00"},{"$f":"C36*Tabla1442[[#This Row],[PRECIO UNITARIO]]","v":{"v":12,"d":"$ 12.00"}},0,{"v":12,"d":"$ 12.00"},{"v":12,"d":"$ 12.00"},"CANCELADO",{"$f":"Tabla1442[[#This Row],[VALOR A PAGAR]]-Tabla1442[[#This Row],[VALOR CANCELADO]]","v":0}]
["2025-04-14","BAEKJUL TEAM FERNÁNDEZ",4,{"v":8,"d":"$ 8.00"},{"$f":"C37*Tabla1442[[#This Row],[PRECIO UNITARIO]]","v":{"v":32,"d":"$ 32.00"}},0,{"v":32,"d":"$ 32.00"},{"v":32,"d":"$ 32.00"},"CANCELADO",{"$f":"Tabla1442[[#This Row],[VALOR A PAGAR]]-Tabla1442[[#This Row],[VALOR CANCELADO]]","v":0}]
["2025-04-14","SOCIEDAD DEPORTIVA CENTRAL",2,{"v":8,"d":"$ 8.00"},{"$f":"C38*Tabla1442[[#This Row],[PRECIO UNITARIO]]","v":{"v":16,"d":"$ 16.00"}},{"v":16,"d":"$ 16.00"},0,{"v":16,"d":"$ 16.00"},"CANCELADO",{"$f":"Tabla1442[[#This Row],[VALOR A PAGAR]]-Tabla1442[[#This Row],[VALOR CANCELADO]]","v":0}]
["2025-04-15","YONG TIGER",3,{"v":6,"d":"$ 6.00"},{"$f":"C39*Tabla1442[[#This Row],[PRECIO UNITARIO]]","v":{"v":18,"d":"$ 18.00"}},0,{"v":18,"d":"$ 18.00"},{"v":18,"d":"$ 18.00"},"CANCELADO",{"$f":"Tabla1442[[#This Row],[VALOR A PAGAR]]-Tabla1442[[#This Row],[VALOR CANCELADO]]","v":0},"EN 3 DEPÓSITOS LE QUEDA UN SALDO A FAVOR DE $12"]
["2025-04-16","BAEKJUL TEAM FERNÁNDEZ",3,{"v":8,"d":"$ 8.00"},{"$f":"C40*Tabla1442[[#This Row],[PRECIO UNITARIO]]","v":{"v":24,"d":"$ 24.00"}},0,{"v":24,"d":"$ 24.00"},{"v":24,"d":"$ 24.00"},"CANCELADO",{"$f":"Tabla1442[[#This Row],[VALOR A PAGAR]]-Tabla1442[[#This Row],[VALOR CANCELADO]]","v":0}]
["2025-04-21","ARES",2,{"v":8,"d":"$ 8.00"},{"$f":"C41*Tabla1442[[#This Row],[PRECIO UNITARIO]]","v":{"v":16,"d":"$ 16.00"}},0,{"v":16,"d":"$ 16.00"},{"v":16,"d":"$ 16.00"},"CANCELADO",{"$f":"Tabla1442[[#This Row],[VALOR A PAGAR]]-Tabla1442[[#This Row],[VALOR CANCELADO]]","v":0}]
["2025-04-21","MICHAYDO",1,{"v":8,"d":"$ 8.00"},{"$f":"C42*Tabla1442[[#This Row],[PRECIO UNITARIO]]","v":{"v":8,"d":"$ 8.00"}},0,{"v":8,"d":"$ 8.00"},{"v":8,"d":"$ 8.00"},"CANCELADO",{"$f":"Tabla1442[[#This Row],[VALOR A PAGAR]]-Tabla1442[[#This Row],[VALOR CANCELADO]]","v":0},"CANCELA CON  2 CERTIFICADOS DE ASCENSO"]
["2025-04-21","ARES",21,{"v":2,"d":"$ 2.00"},{"$f":"C43*Tabla1442[[#This Row],[PRECIO UNITARIO]]","v":{"v":42,"d":"$ 42.00"}},0,{"v":42,"d":"$ 42.00"},{"v":42,"d":"$ 42.00"},"CANCELADO",{"$f":"Tabla1442[[#This Row],[VALOR A PAGAR]]-Tabla1442[[#This Row],[VALOR CANCELADO]]","v":0},"SOLO IMPRESIÓN DE GAL'S DIGITALES DEL 24-02-2025"]
["2025-04-22","CHUNG SONG",2,{"v":6,"d":"$ 6.00"},{"$f":"C44*Tabla1442[[#This Row],[PRECIO UNITARIO]]","v":{"v":12,"d":"$ 12.00"}},0,{"v":12,"d":"$ 12.00"},{"v":12,"d":"$ 12.00"},"CANCELADO",{"$f":"Tabla1442[[#This Row],[VALOR A PAGAR]]-Tabla1442[[#This Row],[VALOR CANCELADO]]","v":0},"CANCELA CON  34 CERTIFICADOS DE ASCENSO"]
["2025-04-22","ARES",1,{"v":8,"d":"$ 8.00"},{"$f":"C45*Tabla1442[[#This Row],[PRECIO UNITARIO]]","v":{"v":8,"d":"$ 8.00"}},{"v":8,"d":"$ 8.00"},0,{"v":8,"d":"$ 8.00"},"CANCELADO",{"$f":"Tabla1442[[#This Row],[VALOR A PAGAR]]-Tabla1442[[#This Row],[VALOR CANCELADO]]","v":0}]
["2025-04-22","SEUL CARAPUNGO",3,{"v":8,"d":"$ 8.00"},{"$f":"C46*Tabla1442[[#This Row],[PRECIO UNITARIO]]","v":{"v":24,"d":"$ 24.00"}},0,{"v":24,"d":"$ 24.00"},{"v":24,"d":"$ 24.00"},"CANCELADO",{"$f":"Tabla1442[[#This Row],[VALOR A PAGAR]]-Tabla1442[[#This Row],[VALOR CANCELADO]]","v":0}]
["2025-04-22","SEUL CARAPUNGO",5,{"v":6,"d":"$ 6.00"},{"$f":"C47*Tabla1442[[#This Row],[PRECIO UNITARIO]]","v":{"v":30,"d":"$ 30.00"}},0,{"v":30,"d":"$ 30.00"},{"v":30,"d":"$ 30.00"},"CANCELADO",{"$f":"Tabla1442[[#This Row],[VALOR A PAGAR]]-Tabla1442[[#This Row],[VALOR CANCELADO]]","v":0}]
["2025-04-22","SEUL CARAPUNGO",1,{"v":2,"d":"$ 2.00"},{"$f":"C48*Tabla1442[[#This Row],[PRECIO UNITARIO]]","v":{"v":2,"d":"$ 2.00"}},0,{"v":2,"d":"$ 2.00"},{"v":2,"d":"$ 2.00"},"CANCELADO",{"$f":"Tabla1442[[#This Row],[VALOR A PAGAR]]-Tabla1442[[#This Row],[VALOR CANCELADO]]","v":0},"DEPORTISTA CON CAPACIDADES ESPECIALES"]
["2025-04-22","DRAGON LEE GYM",1,{"v":8,"d":"$ 8.00"},{"$f":"C49*Tabla1442[[#This Row],[PRECIO UNITARIO]]","v":{"v":8,"d":"$ 8.00"}},0,{"v":8,"d":"$ 8.00"},{"v":8,"d":"$ 8.00"},"CANCELADO",{"$f":"Tabla1442[[#This Row],[VALOR A PAGAR]]-Tabla1442[[#This Row],[VALOR CANCELADO]]","v":0},"CANCELA CON 1 CERTIFICADO DE ASCENSO"]
["2025-04-23","PVM - ROJAS IAN IRON FIST",1,{"v":8,"d":"$ 8.00"},{"$f":"C50*Tabla1442[[#This Row],[PRECIO UNITARIO]]","v":{"v":8,"d":"$ 8.00"}},0,{"v":8,"d":"$ 8.00"},{"v":8,"d":"$ 8.00"},"CANCELADO",{"$f":"Tabla1442[[#This Row],[VALOR A PAGAR]]-Tabla1442[[#This Row],[VALOR CANCELADO]]","v":0}]
["2025-04-24","ARES",1,{"v":8,"d":"$ 8.00"},{"$f":"C51*Tabla1442[[#This Row],[PRECIO UNITARIO]]","v":{"v":8,"d":"$ 8.00"}},0,{"v":8,"d":"$ 8.00"},{"v":8,"d":"$ 8.00"},"CANCELADO",{"$f":"Tabla1442[[#This Row],[VALOR A PAGAR]]-Tabla1442[[#This Row],[VALOR CANCELADO]]","v":0}]
["2025-04-24","DECIAP",1,{"v":2,"d":"$ 2.00"},{"$f":"C52*Tabla1442[[#This Row],[PRECIO UNITARIO]]","v":{"v":2,"d":"$ 2.00"}},0,0,0,"SALDO PENDIENTE",{"$f":"Tabla1442[[#This Row],[VALOR A PAGAR]]-Tabla1442[[#This Row],[VALOR CANCELADO]]","v":{"v":2,"d":"$ 2.00"}},"IMPRESIÓN CARNET PERSONA CON CAPACIDADES ESPECIALES"]
["2025-04-24","KORYO",10,{"v":8,"d":"$ 8.00"},{"$f":"C53*Tabla1442[[#This Row],[PRECIO UNITARIO]]","v":{"v":80,"d":"$ 80.00"}},0,{"v":80,"d":"$ 80.00"},{"v":80,"d":"$ 80.00"},"CANCELADO",{"$f":"Tabla1442[[#This Row],[VALOR A PAGAR]]-Tabla1442[[#This Row],[VALOR CANCELADO]]","v":0},"CANCELA CON  10 CERTIFICADOS DE ASCENSO"]
["2025-04-25","SEUL CARAPUNGO",2,{"v":8,"d":"$ 8.00"},{"$f":"C54*Tabla1442[[#This Row],[PRECIO UNITARIO]]","v":{"v":16,"d":"$ 16.00"}},0,{"v":16,"d":"$ 16.00"},{"v":16,"d":"$ 16.00"},"CANCELADO",{"$f":"Tabla1442[[#This Row],[VALOR A PAGAR]]-Tabla1442[[#This Row],[VALOR CANCELADO]]","v":0}]
["2025-04-29","DRAGON GYM",1,{"v":2,"d":"$ 2.00"},{"$f":"C55*Tabla1442[[#This Row],[PRECIO UNITARIO]]","v":{"v":2,"d":"$ 2.00"}},0,{"v":2,"d":"$ 2.00"},{"v":2,"d":"$ 2.00"},"CANCELADO",{"$f":"Tabla1442[[#This Row],[VALOR A PAGAR]]-Tabla1442[[#This Row],[VALOR CANCELADO]]","v":0},"REIMPRESIÓN DE GAL"]
["2025-04-30","ESPE",1,{"v":6,"d":"$ 6.00"},{"$f":"C56*Tabla1442[[#This Row],[PRECIO UNITARIO]]","v":{"v":6,"d":"$ 6.00"}},0,{"v":6,"d":"$ 6.00"},{"v":6,"d":"$ 6.00"},"CANCELADO",{"$f":"Tabla1442[[#This Row],[VALOR A PAGAR]]-Tabla1442[[#This Row],[VALOR CANCELADO]]","v":0},"CRUCE DEUDA TRÁMITES EN SRI DE ASOTKDP POR EDUARDO LOACHAMÍN"]
["2025-04-30","ESPE",1,{"v":8,"d":"$ 8.00"},{"$f":"C57*Tabla1442[[#This Row],[PRECIO UNITARIO]]","v":{"v":8,"d":"$ 8.00"}},0,{"v":8,"d":"$ 8.00"},{"v":8,"d":"$ 8.00"},"CANCELADO",{"$f":"Tabla1442[[#This Row],[VALOR A PAGAR]]-Tabla1442[[#This Row],[VALOR CANCELADO]]","v":0}]
["2025-05-05","VILL GYM",10,{"v":8,"d":"$ 8.00"},{"$f":"C58*Tabla1442[[#This Row],[PRECIO UNITARIO]]","v":{"v":80,"d":"$ 80.00"}},0,{"v":80,"d":"$ 80.00"},{"v":80,"d":"$ 80.00"},"CANCELADO",{"$f":"Tabla1442[[#This Row],[VALOR A PAGAR]]-Tabla1442[[#This Row],[VALOR CANCELADO]]","v":0},"CANCELA CON 13 CERTIFICADOS DE ASCENSO"]
["2025-05-06","RAIG DE LLUM",9,{"v":8,"d":"$ 8.00"},{"$f":"C59*Tabla1442[[#This Row],[PRECIO UNITARIO]]","v":{"v":72,"d":"$ 72.00"}},0,{"v":72,"d":"$ 72.00"},{"v":72,"d":"$ 72.00"},"CANCELADO",{"$f":"Tabla1442[[#This Row],[VALOR A PAGAR]]-Tabla1442[[#This Row],[VALOR CANCELADO]]","v":0},"CANCELA CON 19 CERTIFICADOS DE ASCENSO"]
["2025-05-06","KORYO",3,{"v":8,"d":"$ 8.00"},{"$f":"C60*Tabla1442[[#This Row],[PRECIO UNITARIO]]","v":{"v":24,"d":"$ 24.00"}},0,{"v":24,"d":"$ 24.00"},{"v":24,"d":"$ 24.00"},"CANCELADO",{"$f":"Tabla1442[[#This Row],[VALOR A PAGAR]]-Tabla1442[[#This Row],[VALOR CANCELADO]]","v":0}]
["2025-05-07","BAS PANTHERS",3,{"v":8,"d":"$ 8.00"},{"$f":"C61*Tabla1442[[#This Row],[PRECIO UNITARIO]]","v":{"v":24,"d":"$ 24.00"}},0,{"v":24,"d":"$ 24.00"},{"v":24,"d":"$ 24.00"},"CANCELADO",{"$f":"Tabla1442[[#This Row],[VALOR A PAGAR]]-Tabla1442[[#This Row],[VALOR CANCELADO]]","v":0},"CANCELA CON 29 CERTIFICADOS DE ASCENSO"]
["2025-05-07","LEÓN",4,{"v":8,"d":"$ 8.00"},{"$f":"C62*Tabla1442[[#This Row],[PRECIO UNITARIO]]","v":{"v":32,"d":"$ 32.00"}},0,{"v":32,"d":"$ 32.00"},{"v":32,"d":"$ 32.00"},"CANCELADO",{"$f":"Tabla1442[[#This Row],[VALOR A PAGAR]]-Tabla1442[[#This Row],[VALOR CANCELADO]]","v":0}]
["2025-05-09","CHUNG SONG",1,{"v":6,"d":"$ 6.00"},{"$f":"C63*Tabla1442[[#This Row],[PRECIO UNITARIO]]","v":{"v":6,"d":"$ 6.00"}},0,{"v":6,"d":"$ 6.00"},{"v":6,"d":"$ 6.00"},"CANCELADO",{"$f":"Tabla1442[[#This Row],[VALOR A PAGAR]]-Tabla1442[[#This Row],[VALOR CANCELADO]]","v":0},"ENVÍA DATOS POR WHATSAPP"]
["2025-05-09","BORJA'S LIONS",1,{"v":6,"d":"$ 6.00"},{"$f":"C64*Tabla1442[[#This Row],[PRECIO UNITARIO]]","v":{"v":6,"d":"$ 6.00"}},0,{"v":6,"d":"$ 6.00"},{"v":6,"d":"$ 6.00"},"CANCELADO",{"$f":"Tabla1442[[#This Row],[VALOR A PAGAR]]-Tabla1442[[#This Row],[VALOR CANCELADO]]","v":0}]
["2025-05-10","KORYO DF DOJANG",1,{"v":8,"d":"$ 8.00"},{"$f":"C65*Tabla1442[[#This Row],[PRECIO UNITARIO]]","v":{"v":8,"d":"$ 8.00"}},{"v":8,"d":"$ 8.00"},0,{"v":8,"d":"$ 8.00"},"CANCELADO",{"$f":"Tabla1442[[#This Row],[VALOR A PAGAR]]-Tabla1442[[#This Row],[VALOR CANCELADO]]","v":0}]
["2025-05-12","ECUADOR",2,{"v":6,"d":"$ 6.00"},{"$f":"C66*Tabla1442[[#This Row],[PRECIO UNITARIO]]","v":{"v":12,"d":"$ 12.00"}},0,{"v":12,"d":"$ 12.00"},{"v":12,"d":"$ 12.00"},"CANCELADO",{"$f":"Tabla1442[[#This Row],[VALOR A PAGAR]]-Tabla1442[[#This Row],[VALOR CANCELADO]]","v":0},"CANCELA CON 20 CERTIFICADOS DE ASCENSO"]
["2025-05-12","MARCIAL GRANDA",1,{"v":8,"d":"$ 8.00"},{"$f":"C67*Tabla1442[[#This Row],[PRECIO UNITARIO]]","v":{"v":8,"d":"$ 8.00"}},0,{"v":8,"d":"$ 8.00"},{"v":8,"d":"$ 8.00"},"CANCELADO",{"$f":"Tabla1442[[#This Row],[VALOR A PAGAR]]-Tabla1442[[#This Row],[VALOR CANCELADO]]","v":0}]
["2025-05-12","KYORUGUI GYM",2,{"v":6,"d":"$ 6.00"},{"$f":"C68*Tabla1442[[#This Row],[PRECIO UNITARIO]]","v":{"v":12,"d":"$ 12.00"}},0,{"v":12,"d":"$ 12.00"},{"$f":"F68+G68","v":{"v":12,"d":"$ 12.00"}},{"$f":"IF((E68=H68),\"CANCELADO\",\"SALDO PENDIENTE\")","v":"CANCELADO"},{"$f":"Tabla1442[[#This Row],[VALOR A PAGAR]]-Tabla1442[[#This Row],[VALOR CANCELADO]]","v":0}]
["2025-05-12","BORJA'S LIONS",3,{"v":8,"d":"$ 8.00"},{"$f":"C69*Tabla1442[[#This Row],[PRECIO UNITARIO]]","v":{"v":24,"d":"$ 24.00"}},0,{"v":24,"d":"$ 24.00"},{"v":24,"d":"$ 24.00"},"CANCELADO",{"$f":"Tabla1442[[#This Row],[VALOR A PAGAR]]-Tabla1442[[#This Row],[VALOR CANCELADO]]","v":0}]
["2025-05-12","BORJA'S LIONS",3,{"v":2,"d":"$ 2.00"},{"$f":"C70*Tabla1442[[#This Row],[PRECIO UNITARIO]]","v":{"v":6,"d":"$ 6.00"}},0,{"v":6,"d":"$ 6.00"},{"v":6,"d":"$ 6.00"},"CANCELADO",{"$f":"Tabla1442[[#This Row],[VALOR A PAGAR]]-Tabla1442[[#This Row],[VALOR CANCELADO]]","v":0}]
["2025-05-13","PIONERO FORTIS",11,{"v":8,"d":"$ 8.00"},{"$f":"C71*Tabla1442[[#This Row],[PRECIO UNITARIO]]","v":{"v":88,"d":"$ 88.00"}},{"v":8,"d":"$ 8.00"},{"v":80,"d":"$ 80.00"},{"v":88,"d":"$ 88.00"},"CANCELADO",{"$f":"Tabla1442[[#This Row],[VALOR A PAGAR]]-Tabla1442[[#This Row],[VALOR CANCELADO]]","v":0}]
["2025-05-14","RENACER",1,{"v":2,"d":"$ 2.00"},{"$f":"C72*Tabla1442[[#This Row],[PRECIO UNITARIO]]","v":{"v":2,"d":"$ 2.00"}},{"v":2,"d":"$ 2.00"},0,{"v":2,"d":"$ 2.00"},"CANCELADO",{"$f":"Tabla1442[[#This Row],[VALOR A PAGAR]]-Tabla1442[[#This Row],[VALOR CANCELADO]]","v":0},"IMPRESIÓN GAL DE ENTRRENADOR"]
["2025-05-20","SCORPIUS",2,{"v":6,"d":"$ 6.00"},{"$f":"C73*Tabla1442[[#This Row],[PRECIO UNITARIO]]","v":{"v":12,"d":"$ 12.00"}},0,{"v":12,"d":"$ 12.00"},{"v":12,"d":"$ 12.00"},"CANCELADO",{"$f":"Tabla1442[[#This Row],[VALOR A PAGAR]]-Tabla1442[[#This Row],[VALOR CANCELADO]]","v":0}]
["2025-05-21","BAS PANTHERS",5,{"v":8,"d":"$ 8.00"},{"$f":"C74*Tabla1442[[#This Row],[PRECIO UNITARIO]]","v":{"v":40,"d":"$ 40.00"}},0,{"v":40,"d":"$ 40.00"},{"v":40,"d":"$ 40.00"},"CANCELADO",{"$f":"Tabla1442[[#This Row],[VALOR A PAGAR]]-Tabla1442[[#This Row],[VALOR CANCELADO]]","v":0},"CANCELA PARA TRÁMITE DE CERTIFICADOS DE ASCENSO"]
["2025-05-27","BAEKJUL TEAM AYALAZ",3,{"v":8,"d":"$ 8.00"},{"$f":"C75*Tabla1442[[#This Row],[PRECIO UNITARIO]]","v":{"v":24,"d":"$ 24.00"}},0,{"v":24,"d":"$ 24.00"},{"v":24,"d":"$ 24.00"},"CANCELADO",{"$f":"Tabla1442[[#This Row],[VALOR A PAGAR]]-Tabla1442[[#This Row],[VALOR CANCELADO]]","v":0},"CANCELA CON 24 CERTIFICADOS DE ASCENSO"]
["2025-05-27","MINOTAUROS",2,{"v":8,"d":"$ 8.00"},{"$f":"C76*Tabla1442[[#This Row],[PRECIO UNITARIO]]","v":{"v":16,"d":"$ 16.00"}},0,{"v":16,"d":"$ 16.00"},{"v":16,"d":"$ 16.00"},"CANCELADO",{"$f":"Tabla1442[[#This Row],[VALOR A PAGAR]]-Tabla1442[[#This Row],[VALOR CANCELADO]]","v":0},"CANCELA CON 12 CERTIFICADOS DE ASCENSO"]
["2025-05-28","MINOTAUROS",1,{"v":8,"d":"$ 8.00"},{"$f":"C77*Tabla1442[[#This Row],[PRECIO UNITARIO]]","v":{"v":8,"d":"$ 8.00"}},0,{"v":8,"d":"$ 8.00"},{"v":8,"d":"$ 8.00"},"CANCELADO",{"$f":"Tabla1442[[#This Row],[VALOR A PAGAR]]-Tabla1442[[#This Row],[VALOR CANCELADO]]","v":0},"FALTA COMPROBANTE DE DEPÓSITO"]
["2025-06-03","TEKKEN",9,{"v":8,"d":"$ 8.00"},{"$f":"C78*Tabla1442[[#This Row],[PRECIO UNITARIO]]","v":{"v":72,"d":"$ 72.00"}},0,{"v":72,"d":"$ 72.00"},{"v":72,"d":"$ 72.00"},"CANCELADO",{"$f":"Tabla1442[[#This Row],[VALOR A PAGAR]]-Tabla1442[[#This Row],[VALOR CANCELADO]]","v":0}]
["2025-06-05","JOSEON LEGACY",29,{"v":6,"d":"$ 6.00"},{"$f":"C79*Tabla1442[[#This Row],[PRECIO UNITARIO]]","v":{"v":174,"d":"$ 174.00"}},0,{"v":174,"d":"$ 174.00"},{"v":174,"d":"$ 174.00"},"CANCELADO",{"$f":"Tabla1442[[#This Row],[VALOR A PAGAR]]-Tabla1442[[#This Row],[VALOR CANCELADO]]","v":0},"CANCELA CON 64 CERTIFICADOS DE ASCENSO"]
["2025-06-05","JOSEON LEGACY",3,{"v":8,"d":"$ 8.00"},{"$f":"C80*Tabla1442[[#This Row],[PRECIO UNITARIO]]","v":{"v":24,"d":"$ 24.00"}},0,{"v":24,"d":"$ 24.00"},{"v":24,"d":"$ 24.00"},"CANCELADO",{"$f":"Tabla1442[[#This Row],[VALOR A PAGAR]]-Tabla1442[[#This Row],[VALOR CANCELADO]]","v":0}]
["2025-06-06","ASOTKD - P (CHIMBACALLE)",12,{"v":8,"d":"$ 8.00"},{"$f":"C81*Tabla1442[[#This Row],[PRECIO UNITARIO]]","v":{"v":96,"d":"$ 96.00"}},{"v":96,"d":"$ 96.00"},0,{"v":96,"d":"$ 96.00"},"CANCELADO",{"$f":"Tabla1442[[#This Row],[VALOR A PAGAR]]-Tabla1442[[#This Row],[VALOR CANCELADO]]","v":0}]
["2025-06-09","CAMU",12,{"v":8,"d":"$ 8.00"},{"$f":"C82*Tabla1442[[#This Row],[PRECIO UNITARIO]]","v":{"v":96,"d":"$ 96.00"}},0,{"v":96,"d":"$ 96.00"},{"v":96,"d":"$ 96.00"},"CANCELADO",{"$f":"Tabla1442[[#This Row],[VALOR A PAGAR]]-Tabla1442[[#This Row],[VALOR CANCELADO]]","v":0},"CANCELA CON 12 CERTIFICADOS DE ASCENSO"]
["2025-06-11","PALADINS MARCIAL CLUB",8,{"v":8,"d":"$ 8.00"},{"$f":"C83*Tabla1442[[#This Row],[PRECIO UNITARIO]]","v":{"v":64,"d":"$ 64.00"}},0,{"v":64,"d":"$ 64.00"},{"v":64,"d":"$ 64.00"},"CANCELADO",{"$f":"Tabla1442[[#This Row],[VALOR A PAGAR]]-Tabla1442[[#This Row],[VALOR CANCELADO]]","v":0},"CANCELA CON 8 CERTIFICADOS DE ASCENSO"]
["2025-06-11","MINOTAUROS",1,{"v":8,"d":"$ 8.00"},{"$f":"C84*Tabla1442[[#This Row],[PRECIO UNITARIO]]","v":{"v":8,"d":"$ 8.00"}},0,{"v":8,"d":"$ 8.00"},{"v":8,"d":"$ 8.00"},"CANCELADO",{"$f":"Tabla1442[[#This Row],[VALOR A PAGAR]]-Tabla1442[[#This Row],[VALOR CANCELADO]]","v":0}]
["2025-05-15","PYONGYANG",1,{"v":8,"d":"$ 8.00"},{"$f":"C85*Tabla1442[[#This Row],[PRECIO UNITARIO]]","v":{"v":8,"d":"$ 8.00"}},0,{"v":8,"d":"$ 8.00"},{"v":8,"d":"$ 8.00"},"CANCELADO",{"$f":"Tabla1442[[#This Row],[VALOR A PAGAR]]-Tabla1442[[#This Row],[VALOR CANCELADO]]","v":0},"CANCELA CON 12 CERTIFICADOS DE ASCENSO"]
["2025-06-16","TOTAL KOMBAT",7,{"v":6,"d":"$ 6.00"},{"$f":"C86*Tabla1442[[#This Row],[PRECIO UNITARIO]]","v":{"v":42,"d":"$ 42.00"}},0,{"v":42,"d":"$ 42.00"},{"v":42,"d":"$ 42.00"},"CANCELADO",{"$f":"Tabla1442[[#This Row],[VALOR A PAGAR]]-Tabla1442[[#This Row],[VALOR CANCELADO]]","v":0}]
["2025-06-16","TOTAL KOMBAT RHINOS",7,{"v":6,"d":"$ 6.00"},{"$f":"C87*Tabla1442[[#This Row],[PRECIO UNITARIO]]","v":{"v":42,"d":"$ 42.00"}},0,{"v":42,"d":"$ 42.00"},{"v":42,"d":"$ 42.00"},"CANCELADO",{"$f":"Tabla1442[[#This Row],[VALOR A PAGAR]]-Tabla1442[[#This Row],[VALOR CANCELADO]]","v":0}]
["2025-06-16","TOTAL KOMBAT KOBRA KAY",9,{"v":8,"d":"$ 8.00"},{"$f":"C88*Tabla1442[[#This Row],[PRECIO UNITARIO]]","v":{"v":72,"d":"$ 72.00"}},0,{"v":72,"d":"$ 72.00"},{"v":72,"d":"$ 72.00"},"CANCELADO",{"$f":"Tabla1442[[#This Row],[VALOR A PAGAR]]-Tabla1442[[#This Row],[VALOR CANCELADO]]","v":0}]
["2025-06-16","TOTAL KOMBAT KOBRA KAY",2,{"v":6,"d":"$ 6.00"},{"$f":"C89*Tabla1442[[#This Row],[PRECIO UNITARIO]]","v":{"v":12,"d":"$ 12.00"}},0,{"v":12,"d":"$ 12.00"},{"v":12,"d":"$ 12.00"},"CANCELADO",{"$f":"Tabla1442[[#This Row],[VALOR A PAGAR]]-Tabla1442[[#This Row],[VALOR CANCELADO]]","v":0}]
["2025-06-16","TAEBAEK ECUADOR",1,{"v":8,"d":"$ 8.00"},{"$f":"C90*Tabla1442[[#This Row],[PRECIO UNITARIO]]","v":{"v":8,"d":"$ 8.00"}},0,{"v":8,"d":"$ 8.00"},{"v":8,"d":"$ 8.00"},"CANCELADO",{"$f":"Tabla1442[[#This Row],[VALOR A PAGAR]]-Tabla1442[[#This Row],[VALOR CANCELADO]]","v":0}]
["2025-06-16","SAN SEBASTIÁN (LUIS TIPÁN)",5,{"v":8,"d":"$ 8.00"},{"$f":"C91*Tabla1442[[#This Row],[PRECIO UNITARIO]]","v":{"v":40,"d":"$ 40.00"}},0,{"v":40,"d":"$ 40.00"},{"v":40,"d":"$ 40.00"},"CANCELADO",{"$f":"Tabla1442[[#This Row],[VALOR A PAGAR]]-Tabla1442[[#This Row],[VALOR CANCELADO]]","v":0}]
["2025-06-18","BAEKJUL TEAM FERNÁNDEZ",6,{"v":8,"d":"$ 8.00"},{"$f":"C92*Tabla1442[[#This Row],[PRECIO UNITARIO]]","v":{"v":48,"d":"$ 48.00"}},0,{"v":48,"d":"$ 48.00"},{"v":48,"d":"$ 48.00"},"CANCELADO",{"$f":"Tabla1442[[#This Row],[VALOR A PAGAR]]-Tabla1442[[#This Row],[VALOR CANCELADO]]","v":0}]
["2025-06-18","KOREAN DRAGON",15,{"v":8,"d":"$ 8.00"},{"$f":"C93*Tabla1442[[#This Row],[PRECIO UNITARIO]]","v":{"v":120,"d":"$ 120.00"}},0,{"v":120,"d":"$ 120.00"},{"v":120,"d":"$ 120.00"},"CANCELADO",{"$f":"Tabla1442[[#This Row],[VALOR A PAGAR]]-Tabla1442[[#This Row],[VALOR CANCELADO]]","v":0}]
["2025-06-18","KOREAN DRAGON",1,{"v":2,"d":"$ 2.00"},{"$f":"C94*Tabla1442[[#This Row],[PRECIO UNITARIO]]","v":{"v":2,"d":"$ 2.00"}},0,{"v":2,"d":"$ 2.00"},{"v":2,"d":"$ 2.00"},"CANCELADO",{"$f":"Tabla1442[[#This Row],[VALOR A PAGAR]]-Tabla1442[[#This Row],[VALOR CANCELADO]]","v":0},"SOLO IMPRESIÓN DE GAL"]
["2025-06-18","TAEBAEK ECUADOR",1,{"v":8,"d":"$ 8.00"},{"$f":"C95*Tabla1442[[#This Row],[PRECIO UNITARIO]]","v":{"v":8,"d":"$ 8.00"}},0,{"v":8,"d":"$ 8.00"},{"v":8,"d":"$ 8.00"},"CANCELADO",{"$f":"Tabla1442[[#This Row],[VALOR A PAGAR]]-Tabla1442[[#This Row],[VALOR CANCELADO]]","v":0}]
["2025-06-18","PYONGYANG",1,{"v":8,"d":"$ 8.00"},{"$f":"C96*Tabla1442[[#This Row],[PRECIO UNITARIO]]","v":{"v":8,"d":"$ 8.00"}},0,{"v":8,"d":"$ 8.00"},{"v":8,"d":"$ 8.00"},"CANCELADO",{"$f":"Tabla1442[[#This Row],[VALOR A PAGAR]]-Tabla1442[[#This Row],[VALOR CANCELADO]]","v":0}]
["2025-06-19","TOTAL KOMBAT KUKKIWON C.C.",2,{"v":6,"d":"$ 6.00"},{"$f":"C97*Tabla1442[[#This Row],[PRECIO UNITARIO]]","v":{"v":12,"d":"$ 12.00"}},0,{"v":12,"d":"$ 12.00"},{"v":12,"d":"$ 12.00"},"CANCELADO",{"$f":"Tabla1442[[#This Row],[VALOR A PAGAR]]-Tabla1442[[#This Row],[VALOR CANCELADO]]","v":0}]
["2025-06-19","MICHAYDO",3,{"v":8,"d":"$ 8.00"},{"$f":"C98*Tabla1442[[#This Row],[PRECIO UNITARIO]]","v":{"v":24,"d":"$ 24.00"}},0,{"v":24,"d":"$ 24.00"},{"v":24,"d":"$ 24.00"},"CANCELADO",{"$f":"Tabla1442[[#This Row],[VALOR A PAGAR]]-Tabla1442[[#This Row],[VALOR CANCELADO]]","v":0}]
["2025-06-19","MIT-TKD",9,{"v":6,"d":"$ 6.00"},{"$f":"C99*Tabla1442[[#This Row],[PRECIO UNITARIO]]","v":{"v":54,"d":"$ 54.00"}},0,{"v":54,"d":"$ 54.00"},{"v":54,"d":"$ 54.00"},"CANCELADO",{"$f":"Tabla1442[[#This Row],[VALOR A PAGAR]]-Tabla1442[[#This Row],[VALOR CANCELADO]]","v":0}]
["2025-06-19","SIMJANG",2,{"v":6,"d":"$ 6.00"},{"$f":"C100*Tabla1442[[#This Row],[PRECIO UNITARIO]]","v":{"v":12,"d":"$ 12.00"}},{"v":6,"d":"$ 6.00"},{"v":6,"d":"$ 6.00"},{"v":12,"d":"$ 12.00"},"CANCELADO",{"$f":"Tabla1442[[#This Row],[VALOR A PAGAR]]-Tabla1442[[#This Row],[VALOR CANCELADO]]","v":0},"CANCELA CON 25 CERTIFICADOS DE ASCENSO"]
["2025-06-19","CHEN HUU",8,{"v":8,"d":"$ 8.00"},{"$f":"C101*Tabla1442[[#This Row],[PRECIO UNITARIO]]","v":{"v":64,"d":"$ 64.00"}},0,{"v":64,"d":"$ 64.00"},{"v":64,"d":"$ 64.00"},"CANCELADO",{"$f":"Tabla1442[[#This Row],[VALOR A PAGAR]]-Tabla1442[[#This Row],[VALOR CANCELADO]]","v":0},"CANCELA CON 8 CERTIFICADOS DE ASCENSO"]
["2025-06-19","JOSEON LEGACY",1,{"v":6,"d":"$ 6.00"},{"$f":"C102*Tabla1442[[#This Row],[PRECIO UNITARIO]]","v":{"v":6,"d":"$ 6.00"}},0,{"v":6,"d":"$ 6.00"},{"v":6,"d":"$ 6.00"},"CANCELADO",{"$f":"Tabla1442[[#This Row],[VALOR A PAGAR]]-Tabla1442[[#This Row],[VALOR CANCELADO]]","v":0}]
["2025-06-19","TAE SHO KU",33,{"v":6,"d":"$ 6.00"},{"$f":"C103*Tabla1442[[#This Row],[PRECIO UNITARIO]]","v":{"v":198,"d":"$ 198.00"}},0,{"v":198,"d":"$ 198.00"},{"v":198,"d":"$ 198.00"},"CANCELADO",{"$f":"Tabla1442[[#This Row],[VALOR A PAGAR]]-Tabla1442[[#This Row],[VALOR CANCELADO]]","v":0},"CANCELA CON 50 CERTIFICADOS DE ASCENSO"]
["2025-06-19","CAMU",19,{"v":8,"d":"$ 8.00"},{"$f":"C104*Tabla1442[[#This Row],[PRECIO UNITARIO]]","v":{"v":152,"d":"$ 152.00"}},0,{"v":152,"d":"$ 152.00"},{"v":152,"d":"$ 152.00"},"CANCELADO",{"$f":"Tabla1442[[#This Row],[VALOR A PAGAR]]-Tabla1442[[#This Row],[VALOR CANCELADO]]","v":0}]
["2025-06-19","ARES",31,{"v":8,"d":"$ 8.00"},{"$f":"C105*Tabla1442[[#This Row],[PRECIO UNITARIO]]","v":{"v":248,"d":"$ 248.00"}},0,{"v":248,"d":"$ 248.00"},{"v":248,"d":"$ 248.00"},"CANCELADO",{"$f":"Tabla1442[[#This Row],[VALOR A PAGAR]]-Tabla1442[[#This Row],[VALOR CANCELADO]]","v":0}]
["2025-06-20","HANKUMDO",6,{"v":8,"d":"$ 8.00"},{"$f":"C106*Tabla1442[[#This Row],[PRECIO UNITARIO]]","v":{"v":48,"d":"$ 48.00"}},0,{"v":48,"d":"$ 48.00"},{"v":48,"d":"$ 48.00"},"CANCELADO",{"$f":"Tabla1442[[#This Row],[VALOR A PAGAR]]-Tabla1442[[#This Row],[VALOR CANCELADO]]","v":0},1]
["2025-06-20","TAE WOONG",2,{"v":8,"d":"$ 8.00"},{"$f":"C107*Tabla1442[[#This Row],[PRECIO UNITARIO]]","v":{"v":16,"d":"$ 16.00"}},0,{"v":16,"d":"$ 16.00"},{"v":16,"d":"$ 16.00"},"CANCELADO",{"$f":"Tabla1442[[#This Row],[VALOR A PAGAR]]-Tabla1442[[#This Row],[VALOR CANCELADO]]","v":0}]
["2025-06-20","ECUADOR",10,{"v":6,"d":"$ 6.00"},{"$f":"C108*Tabla1442[[#This Row],[PRECIO UNITARIO]]","v":{"v":60,"d":"$ 60.00"}},0,{"v":60,"d":"$ 60.00"},{"v":60,"d":"$ 60.00"},"CANCELADO",{"$f":"Tabla1442[[#This Row],[VALOR A PAGAR]]-Tabla1442[[#This Row],[VALOR CANCELADO]]","v":0},"CANCELA CON 33 CERTIFICADOS DE ASCENSO"]
["2025-06-20","APOLO",8,{"v":2,"d":"$ 2.00"},{"$f":"C109*Tabla1442[[#This Row],[PRECIO UNITARIO]]","v":{"v":16,"d":"$ 16.00"}},0,{"v":16,"d":"$ 16.00"},{"v":16,"d":"$ 16.00"},"CANCELADO",{"$f":"Tabla1442[[#This Row],[VALOR A PAGAR]]-Tabla1442[[#This Row],[VALOR CANCELADO]]","v":0},"CANCELA EN 2 PAGOS"]
["2025-06-20","APOLO",14,{"v":6,"d":"$ 6.00"},{"$f":"C110*Tabla1442[[#This Row],[PRECIO UNITARIO]]","v":{"v":84,"d":"$ 84.00"}},0,{"v":84,"d":"$ 84.00"},{"v":84,"d":"$ 84.00"},"CANCELADO",{"$f":"Tabla1442[[#This Row],[VALOR A PAGAR]]-Tabla1442[[#This Row],[VALOR CANCELADO]]","v":0}]
["2025-06-20","APOLO",1,{"v":8,"d":"$ 8.00"},{"$f":"C111*Tabla1442[[#This Row],[PRECIO UNITARIO]]","v":{"v":8,"d":"$ 8.00"}},0,{"v":8,"d":"$ 8.00"},{"v":8,"d":"$ 8.00"},"CANCELADO",{"$f":"Tabla1442[[#This Row],[VALOR A PAGAR]]-Tabla1442[[#This Row],[VALOR CANCELADO]]","v":0}]
["2025-06-20","BORJA'S LIONS",10,{"v":8,"d":"$ 8.00"},{"$f":"C112*Tabla1442[[#This Row],[PRECIO UNITARIO]]","v":{"v":80,"d":"$ 80.00"}},0,{"v":80,"d":"$ 80.00"},{"v":80,"d":"$ 80.00"},"CANCELADO",{"$f":"Tabla1442[[#This Row],[VALOR A PAGAR]]-Tabla1442[[#This Row],[VALOR CANCELADO]]","v":0},"UN SOLO TRÁMITE"]
["2025-06-20","BORJA'S LIONS",2,{"v":6,"d":"$ 6.00"},{"$f":"C113*Tabla1442[[#This Row],[PRECIO UNITARIO]]","v":{"v":12,"d":"$ 12.00"}},0,{"v":12,"d":"$ 12.00"},{"v":12,"d":"$ 12.00"},"CANCELADO",{"$f":"Tabla1442[[#This Row],[VALOR A PAGAR]]-Tabla1442[[#This Row],[VALOR CANCELADO]]","v":0}]
["2025-06-20","BORJA'S LIONS",2,{"v":2,"d":"$ 2.00"},{"$f":"C114*Tabla1442[[#This Row],[PRECIO UNITARIO]]","v":{"v":4,"d":"$ 4.00"}},0,{"v":4,"d":"$ 4.00"},{"v":4,"d":"$ 4.00"},"CANCELADO",{"$f":"Tabla1442[[#This Row],[VALOR A PAGAR]]-Tabla1442[[#This Row],[VALOR CANCELADO]]","v":0}]
["2025-06-20","MOODUKKWAN TRAINING CENTER",2,{"v":8,"d":"$ 8.00"},{"$f":"C115*Tabla1442[[#This Row],[PRECIO UNITARIO]]","v":{"v":16,"d":"$ 16.00"}},0,{"v":16,"d":"$ 16.00"},{"v":16,"d":"$ 16.00"},"CANCELADO",{"$f":"Tabla1442[[#This Row],[VALOR A PAGAR]]-Tabla1442[[#This Row],[VALOR CANCELADO]]","v":0}]
["2025-06-20","MOODUKKWAN TRAINING CENTER",2,{"v":6,"d":"$ 6.00"},{"$f":"C116*Tabla1442[[#This Row],[PRECIO UNITARIO]]","v":{"v":12,"d":"$ 12.00"}},0,{"v":12,"d":"$ 12.00"},{"v":12,"d":"$ 12.00"},"CANCELADO",{"$f":"Tabla1442[[#This Row],[VALOR A PAGAR]]-Tabla1442[[#This Row],[VALOR CANCELADO]]","v":0}]
["2025-06-23","KUKKIWON",3,{"v":8,"d":"$ 8.00"},{"$f":"C117*Tabla1442[[#This Row],[PRECIO UNITARIO]]","v":{"v":24,"d":"$ 24.00"}},0,{"v":24,"d":"$ 24.00"},{"v":24,"d":"$ 24.00"},"CANCELADO",{"$f":"Tabla1442[[#This Row],[VALOR A PAGAR]]-Tabla1442[[#This Row],[VALOR CANCELADO]]","v":0},"REALIZA DOS PAGOS"]
["2025-06-23","KUMGANG DUL",1,{"v":8,"d":"$ 8.00"},{"$f":"C118*Tabla1442[[#This Row],[PRECIO UNITARIO]]","v":{"v":8,"d":"$ 8.00"}},0,{"v":8,"d":"$ 8.00"},{"v":8,"d":"$ 8.00"},"CANCELADO",{"$f":"Tabla1442[[#This Row],[VALOR A PAGAR]]-Tabla1442[[#This Row],[VALOR CANCELADO]]","v":0},"UN SOLO PAGO"]
["2025-06-23","KUMGANG DUL",4,{"v":6,"d":"$ 6.00"},{"$f":"C119*Tabla1442[[#This Row],[PRECIO UNITARIO]]","v":{"v":24,"d":"$ 24.00"}},0,{"v":24,"d":"$ 24.00"},{"v":24,"d":"$ 24.00"},"CANCELADO",{"$f":"Tabla1442[[#This Row],[VALOR A PAGAR]]-Tabla1442[[#This Row],[VALOR CANCELADO]]","v":0}]
["2025-06-23","SOCIEDAD DEPORTIVA CENTRAL",13,{"v":6,"d":"$ 6.00"},{"$f":"C120*Tabla1442[[#This Row],[PRECIO UNITARIO]]","v":{"v":78,"d":"$ 78.00"}},{"v":78,"d":"$ 78.00"},0,{"v":78,"d":"$ 78.00"},"CANCELADO",{"$f":"Tabla1442[[#This Row],[VALOR A PAGAR]]-Tabla1442[[#This Row],[VALOR CANCELADO]]","v":0}]
["2025-06-23","SOCIEDAD DEPORTIVA CENTRAL",2,{"v":8,"d":"$ 8.00"},{"$f":"C121*Tabla1442[[#This Row],[PRECIO UNITARIO]]","v":{"v":16,"d":"$ 16.00"}},{"v":16,"d":"$ 16.00"},0,{"v":16,"d":"$ 16.00"},"CANCELADO",{"$f":"Tabla1442[[#This Row],[VALOR A PAGAR]]-Tabla1442[[#This Row],[VALOR CANCELADO]]","v":0}]
["2025-06-24","TAEGUK JUCARO",3,{"v":8,"d":"$ 8.00"},{"$f":"C122*Tabla1442[[#This Row],[PRECIO UNITARIO]]","v":{"v":24,"d":"$ 24.00"}},0,{"v":24,"d":"$ 24.00"},{"v":24,"d":"$ 24.00"},"CANCELADO",{"$f":"Tabla1442[[#This Row],[VALOR A PAGAR]]-Tabla1442[[#This Row],[VALOR CANCELADO]]","v":0}]
["2025-06-24","SEUL",1,{"v":6,"d":"$ 6.00"},{"$f":"C123*Tabla1442[[#This Row],[PRECIO UNITARIO]]","v":{"v":6,"d":"$ 6.00"}},0,{"v":6,"d":"$ 6.00"},{"v":6,"d":"$ 6.00"},"CANCELADO",{"$f":"Tabla1442[[#This Row],[VALOR A PAGAR]]-Tabla1442[[#This Row],[VALOR CANCELADO]]","v":0},"PARA GESTIÓN DE CERTIFICADO DE ASCENSO"]
["2025-06-25","CHAMPIONS FOR LIFE",7,{"v":6,"d":"$ 6.00"},{"$f":"C124*Tabla1442[[#This Row],[PRECIO UNITARIO]]","v":{"v":42,"d":"$ 42.00"}},0,{"v":42,"d":"$ 42.00"},{"v":42,"d":"$ 42.00"},"CANCELADO",{"$f":"Tabla1442[[#This Row],[VALOR A PAGAR]]-Tabla1442[[#This Row],[VALOR CANCELADO]]","v":0},"CARCELA EN  2 PAGOS"]
["2025-06-25","MOODUKKWAN TRAINING CENTER",1,{"v":6,"d":"$ 6.00"},{"$f":"C125*Tabla1442[[#This Row],[PRECIO UNITARIO]]","v":{"v":6,"d":"$ 6.00"}},0,{"v":6,"d":"$ 6.00"},{"v":6,"d":"$ 6.00"},"CANCELADO",{"$f":"Tabla1442[[#This Row],[VALOR A PAGAR]]-Tabla1442[[#This Row],[VALOR CANCELADO]]","v":0}]
["2025-06-25","PIONERO FORTIS",3,{"v":8,"d":"$ 8.00"},{"$f":"C126*Tabla1442[[#This Row],[PRECIO UNITARIO]]","v":{"v":24,"d":"$ 24.00"}},{"v":24,"d":"$ 24.00"},0,{"v":24,"d":"$ 24.00"},"CANCELADO",{"$f":"Tabla1442[[#This Row],[VALOR A PAGAR]]-Tabla1442[[#This Row],[VALOR CANCELADO]]","v":0}]
["2025-06-25","SEUL CARAPUNGO",5,{"v":8,"d":"$ 8.00"},{"$f":"C127*Tabla1442[[#This Row],[PRECIO UNITARIO]]","v":{"v":40,"d":"$ 40.00"}},0,{"v":40,"d":"$ 40.00"},{"v":40,"d":"$ 40.00"},"CANCELADO",{"$f":"Tabla1442[[#This Row],[VALOR A PAGAR]]-Tabla1442[[#This Row],[VALOR CANCELADO]]","v":0}]
["2025-06-25","SEUL CARAPUNGO",6,{"v":6,"d":"$ 6.00"},{"$f":"C128*Tabla1442[[#This Row],[PRECIO UNITARIO]]","v":{"v":36,"d":"$ 36.00"}},0,{"v":36,"d":"$ 36.00"},{"v":36,"d":"$ 36.00"},"CANCELADO",{"$f":"Tabla1442[[#This Row],[VALOR A PAGAR]]-Tabla1442[[#This Row],[VALOR CANCELADO]]","v":0}]
["2025-06-26","ASOTKD - P (VICENTINA)",6,{"v":6,"d":"$ 6.00"},{"$f":"C129*Tabla1442[[#This Row],[PRECIO UNITARIO]]","v":{"v":36,"d":"$ 36.00"}},{"v":36,"d":"$ 36.00"},0,{"v":36,"d":"$ 36.00"},"CANCELADO",{"$f":"Tabla1442[[#This Row],[VALOR A PAGAR]]-Tabla1442[[#This Row],[VALOR CANCELADO]]","v":0}]
["2025-06-26","ASOTKD - P (VICENTINA)",11,{"v":8,"d":"$ 8.00"},{"$f":"C130*Tabla1442[[#This Row],[PRECIO UNITARIO]]","v":{"v":88,"d":"$ 88.00"}},{"v":88,"d":"$ 88.00"},0,{"v":88,"d":"$ 88.00"},"CANCELADO",{"$f":"Tabla1442[[#This Row],[VALOR A PAGAR]]-Tabla1442[[#This Row],[VALOR CANCELADO]]","v":0}]
["2025-06-26","TAEBAEK ECUADOR",1,{"v":8,"d":"$ 8.00"},{"$f":"C131*Tabla1442[[#This Row],[PRECIO UNITARIO]]","v":{"v":8,"d":"$ 8.00"}},0,{"v":8,"d":"$ 8.00"},{"v":8,"d":"$ 8.00"},"CANCELADO",{"$f":"Tabla1442[[#This Row],[VALOR A PAGAR]]-Tabla1442[[#This Row],[VALOR CANCELADO]]","v":0}]
["2025-06-26","KYORUGUI GYM",5,{"v":6,"d":"$ 6.00"},{"$f":"C132*Tabla1442[[#This Row],[PRECIO UNITARIO]]","v":{"v":30,"d":"$ 30.00"}},0,{"v":30,"d":"$ 30.00"},{"$f":"F132+G132","v":{"v":30,"d":"$ 30.00"}},{"$f":"IF((E132=H132),\"CANCELADO\",\"SALDO PENDIENTE\")","v":"CANCELADO"},{"$f":"Tabla1442[[#This Row],[VALOR A PAGAR]]-Tabla1442[[#This Row],[VALOR CANCELADO]]","v":0},"CANCELA CON 6 CERTIFICADOS DE ASCENSO"]
["2025-06-26","MOODUKKWAN TRAINING CENTER",1,{"v":6,"d":"$ 6.00"},{"$f":"C133*Tabla1442[[#This Row],[PRECIO UNITARIO]]","v":{"v":6,"d":"$ 6.00"}},0,{"v":6,"d":"$ 6.00"},{"v":6,"d":"$ 6.00"},"CANCELADO",{"$f":"Tabla1442[[#This Row],[VALOR A PAGAR]]-Tabla1442[[#This Row],[VALOR CANCELADO]]","v":0}]
["2025-06-26","BORJA'S LIONS",8,{"v":8,"d":"$ 8.00"},{"$f":"C134*Tabla1442[[#This Row],[PRECIO UNITARIO]]","v":{"v":64,"d":"$ 64.00"}},0,{"v":64,"d":"$ 64.00"},{"v":64,"d":"$ 64.00"},"CANCELADO",{"$f":"Tabla1442[[#This Row],[VALOR A PAGAR]]-Tabla1442[[#This Row],[VALOR CANCELADO]]","v":0},"CANCELA EN DOS PAGOS"]
["2025-06-26","BORJA'S LIONS",3,{"v":6,"d":"$ 6.00"},{"$f":"C135*Tabla1442[[#This Row],[PRECIO UNITARIO]]","v":{"v":18,"d":"$ 18.00"}},0,{"v":18,"d":"$ 18.00"},{"v":18,"d":"$ 18.00"},"CANCELADO",{"$f":"Tabla1442[[#This Row],[VALOR A PAGAR]]-Tabla1442[[#This Row],[VALOR CANCELADO]]","v":0}]
["2025-06-26","JERATHEL",2,{"v":8,"d":"$ 8.00"},{"$f":"C136*Tabla1442[[#This Row],[PRECIO UNITARIO]]","v":{"v":16,"d":"$ 16.00"}},0,{"v":16,"d":"$ 16.00"},{"v":16,"d":"$ 16.00"},"CANCELADO",{"$f":"Tabla1442[[#This Row],[VALOR A PAGAR]]-Tabla1442[[#This Row],[VALOR CANCELADO]]","v":0}]
["2025-06-26","YONG TIGER",6,{"v":6,"d":"$ 6.00"},{"$f":"C137*Tabla1442[[#This Row],[PRECIO UNITARIO]]","v":{"v":36,"d":"$ 36.00"}},0,{"v":36,"d":"$ 36.00"},{"v":36,"d":"$ 36.00"},"CANCELADO",{"$f":"Tabla1442[[#This Row],[VALOR A PAGAR]]-Tabla1442[[#This Row],[VALOR CANCELADO]]","v":0}]
["2025-06-26","BORJA'S LIONS",4,{"v":6,"d":"$ 6.00"},{"$f":"C138*Tabla1442[[#This Row],[PRECIO UNITARIO]]","v":{"v":24,"d":"$ 24.00"}},0,{"v":24,"d":"$ 24.00"},{"v":24,"d":"$ 24.00"},"CANCELADO",{"$f":"Tabla1442[[#This Row],[VALOR A PAGAR]]-Tabla1442[[#This Row],[VALOR CANCELADO]]","v":0},"CANCELA EN DOS PAGOS"]
["2025-06-26","SOCIEDAD DEPORTIVA CENTRAL",3,{"v":6,"d":"$ 6.00"},{"$f":"C139*Tabla1442[[#This Row],[PRECIO UNITARIO]]","v":{"v":18,"d":"$ 18.00"}},{"v":18,"d":"$ 18.00"},0,{"v":18,"d":"$ 18.00"},"CANCELADO",{"$f":"Tabla1442[[#This Row],[VALOR A PAGAR]]-Tabla1442[[#This Row],[VALOR CANCELADO]]","v":0},"PASO CON DEUDAS"]
["2025-06-26","MARCIAL GRANDA",1,{"v":6,"d":"$ 6.00"},{"$f":"C140*Tabla1442[[#This Row],[PRECIO UNITARIO]]","v":{"v":6,"d":"$ 6.00"}},0,{"v":6,"d":"$ 6.00"},{"v":6,"d":"$ 6.00"},"CANCELADO",{"$f":"Tabla1442[[#This Row],[VALOR A PAGAR]]-Tabla1442[[#This Row],[VALOR CANCELADO]]","v":0}]
["2025-06-26","BAEKJUL TEAM AYALAZ",1,{"v":8,"d":"$ 8.00"},{"$f":"C141*Tabla1442[[#This Row],[PRECIO UNITARIO]]","v":{"v":8,"d":"$ 8.00"}},0,{"v":8,"d":"$ 8.00"},{"v":8,"d":"$ 8.00"},"CANCELADO",{"$f":"Tabla1442[[#This Row],[VALOR A PAGAR]]-Tabla1442[[#This Row],[VALOR CANCELADO]]","v":0}]
["2025-06-26","DOJANG TKD MELO",1,{"v":8,"d":"$ 8.00"},{"$f":"C142*Tabla1442[[#This Row],[PRECIO UNITARIO]]","v":{"v":8,"d":"$ 8.00"}},0,{"v":8,"d":"$ 8.00"},{"v":8,"d":"$ 8.00"},"CANCELADO",{"$f":"Tabla1442[[#This Row],[VALOR A PAGAR]]-Tabla1442[[#This Row],[VALOR CANCELADO]]","v":0}]
["2025-06-26","BAEKJUL",2,{"v":8,"d":"$ 8.00"},{"$f":"C143*Tabla1442[[#This Row],[PRECIO UNITARIO]]","v":{"v":16,"d":"$ 16.00"}},0,{"v":16,"d":"$ 16.00"},{"v":16,"d":"$ 16.00"},"CANCELADO",{"$f":"Tabla1442[[#This Row],[VALOR A PAGAR]]-Tabla1442[[#This Row],[VALOR CANCELADO]]","v":0}]
["2025-06-26","SHOGUN",7,{"v":6,"d":"$ 6.00"},{"$f":"C144*Tabla1442[[#This Row],[PRECIO UNITARIO]]","v":{"v":42,"d":"$ 42.00"}},0,{"v":42,"d":"$ 42.00"},{"v":42,"d":"$ 42.00"},"CANCELADO",{"$f":"Tabla1442[[#This Row],[VALOR A PAGAR]]-Tabla1442[[#This Row],[VALOR CANCELADO]]","v":0},"CANCELA CON 23 CERTIFICADOS DE ASCENSO"]
["2025-06-26","FURIA NEGRA",4,{"v":8,"d":"$ 8.00"},{"$f":"C145*Tabla1442[[#This Row],[PRECIO UNITARIO]]","v":{"v":32,"d":"$ 32.00"}},0,{"v":32,"d":"$ 32.00"},{"v":32,"d":"$ 32.00"},"CANCELADO",{"$f":"Tabla1442[[#This Row],[VALOR A PAGAR]]-Tabla1442[[#This Row],[VALOR CANCELADO]]","v":0}]
["2025-06-26","FURIA NEGRA",1,{"v":6,"d":"$ 6.00"},{"$f":"C146*Tabla1442[[#This Row],[PRECIO UNITARIO]]","v":{"v":6,"d":"$ 6.00"}},0,{"v":6,"d":"$ 6.00"},{"v":6,"d":"$ 6.00"},"CANCELADO",{"$f":"Tabla1442[[#This Row],[VALOR A PAGAR]]-Tabla1442[[#This Row],[VALOR CANCELADO]]","v":0}]
["2025-06-26","SURYUN",9,{"v":6,"d":"$ 6.00"},{"$f":"C147*Tabla1442[[#This Row],[PRECIO UNITARIO]]","v":{"v":54,"d":"$ 54.00"}},0,{"v":54,"d":"$ 54.00"},{"v":54,"d":"$ 54.00"},"CANCELADO",{"$f":"Tabla1442[[#This Row],[VALOR A PAGAR]]-Tabla1442[[#This Row],[VALOR CANCELADO]]","v":0}]
["2025-06-26","CIUDAD DE QUITO",1,{"v":8,"d":"$ 8.00"},{"$f":"C148*Tabla1442[[#This Row],[PRECIO UNITARIO]]","v":{"v":8,"d":"$ 8.00"}},0,{"v":8,"d":"$ 8.00"},{"v":8,"d":"$ 8.00"},"CANCELADO",{"$f":"Tabla1442[[#This Row],[VALOR A PAGAR]]-Tabla1442[[#This Row],[VALOR CANCELADO]]","v":0}]
["2025-06-26","DRACO",12,{"v":6,"d":"$ 6.00"},{"$f":"C149*Tabla1442[[#This Row],[PRECIO UNITARIO]]","v":{"v":72,"d":"$ 72.00"}},0,{"v":72,"d":"$ 72.00"},{"v":72,"d":"$ 72.00"},"CANCELADO",{"$f":"Tabla1442[[#This Row],[VALOR A PAGAR]]-Tabla1442[[#This Row],[VALOR CANCELADO]]","v":0}]
["2025-06-26","ESPE",2,{"v":6,"d":"$ 6.00"},{"$f":"C150*Tabla1442[[#This Row],[PRECIO UNITARIO]]","v":{"v":12,"d":"$ 12.00"}},0,{"v":12,"d":"$ 12.00"},{"v":12,"d":"$ 12.00"},"CANCELADO",{"$f":"Tabla1442[[#This Row],[VALOR A PAGAR]]-Tabla1442[[#This Row],[VALOR CANCELADO]]","v":0}]
["2025-06-27","DEBAK TKD",11,{"v":6,"d":"$ 6.00"},{"$f":"C151*Tabla1442[[#This Row],[PRECIO UNITARIO]]","v":{"v":66,"d":"$ 66.00"}},0,{"v":66,"d":"$ 66.00"},{"v":66,"d":"$ 66.00"},"CANCELADO",{"$f":"Tabla1442[[#This Row],[VALOR A PAGAR]]-Tabla1442[[#This Row],[VALOR CANCELADO]]","v":0}]
["2025-06-27","DEBAK TKD",2,{"v":8,"d":"$ 8.00"},{"$f":"C152*Tabla1442[[#This Row],[PRECIO UNITARIO]]","v":{"v":16,"d":"$ 16.00"}},0,{"v":16,"d":"$ 16.00"},{"v":16,"d":"$ 16.00"},"CANCELADO",{"$f":"Tabla1442[[#This Row],[VALOR A PAGAR]]-Tabla1442[[#This Row],[VALOR CANCELADO]]","v":0}]
["2025-06-27","ESPE",1,{"v":6,"d":"$ 6.00"},{"$f":"C153*Tabla1442[[#This Row],[PRECIO UNITARIO]]","v":{"v":6,"d":"$ 6.00"}},0,{"v":6,"d":"$ 6.00"},{"v":6,"d":"$ 6.00"},"CANCELADO",{"$f":"Tabla1442[[#This Row],[VALOR A PAGAR]]-Tabla1442[[#This Row],[VALOR CANCELADO]]","v":0}]
["2025-06-27","LEÓN",1,{"v":8,"d":"$ 8.00"},{"$f":"C154*Tabla1442[[#This Row],[PRECIO UNITARIO]]","v":{"v":8,"d":"$ 8.00"}},0,{"v":8,"d":"$ 8.00"},{"v":8,"d":"$ 8.00"},"CANCELADO",{"$f":"Tabla1442[[#This Row],[VALOR A PAGAR]]-Tabla1442[[#This Row],[VALOR CANCELADO]]","v":0},"CANCECA CON 1 CERTIFICADO DE ASCENSO"]
["2025-06-28","ASOTKD - P (CHIMBACALLE)",1,{"v":8,"d":"$ 8.00"},{"$f":"C155*Tabla1442[[#This Row],[PRECIO UNITARIO]]","v":{"v":8,"d":"$ 8.00"}},{"v":8,"d":"$ 8.00"},0,{"v":8,"d":"$ 8.00"},"CANCELADO",{"$f":"Tabla1442[[#This Row],[VALOR A PAGAR]]-Tabla1442[[#This Row],[VALOR CANCELADO]]","v":0}]
["2025-06-30","SOCIEDAD DEPORTIVA CENTRAL",5,{"v":8,"d":"$ 8.00"},{"$f":"C156*Tabla1442[[#This Row],[PRECIO UNITARIO]]","v":{"v":40,"d":"$ 40.00"}},0,{"v":40,"d":"$ 40.00"},{"v":40,"d":"$ 40.00"},"CANCELADO",{"$f":"Tabla1442[[#This Row],[VALOR A PAGAR]]-Tabla1442[[#This Row],[VALOR CANCELADO]]","v":0},"PROFE WILLIAM COLA"]
["2025-07-01","DRAGON LEE GYM",1,{"v":8,"d":"$ 8.00"},{"$f":"C157*Tabla1442[[#This Row],[PRECIO UNITARIO]]","v":{"v":8,"d":"$ 8.00"}},0,{"v":8,"d":"$ 8.00"},{"v":8,"d":"$ 8.00"},"CANCELADO",{"$f":"Tabla1442[[#This Row],[VALOR A PAGAR]]-Tabla1442[[#This Row],[VALOR CANCELADO]]","v":0},"CANCELA CON 4 CERTIFICADOS DE ASCENSO"]
["2025-07-01","PVM - ROJAS IAN IRON FIST",1,{"v":8,"d":"$ 8.00"},{"$f":"C158*Tabla1442[[#This Row],[PRECIO UNITARIO]]","v":{"v":8,"d":"$ 8.00"}},0,{"v":8,"d":"$ 8.00"},{"v":8,"d":"$ 8.00"},"CANCELADO",{"$f":"Tabla1442[[#This Row],[VALOR A PAGAR]]-Tabla1442[[#This Row],[VALOR CANCELADO]]","v":0}]
["2025-07-02","TAE SHO KU",2,{"v":6,"d":"$ 6.00"},{"$f":"C159*Tabla1442[[#This Row],[PRECIO UNITARIO]]","v":{"v":12,"d":"$ 12.00"}},0,{"v":12,"d":"$ 12.00"},{"v":12,"d":"$ 12.00"},"CANCELADO",{"$f":"Tabla1442[[#This Row],[VALOR A PAGAR]]-Tabla1442[[#This Row],[VALOR CANCELADO]]","v":0},"CANCELA CON 4 CERTIFICADOS DE ASCENSO"]
["2025-07-03","LEÓN",1,{"v":8,"d":"$ 8.00"},{"$f":"C160*Tabla1442[[#This Row],[PRECIO UNITARIO]]","v":{"v":8,"d":"$ 8.00"}},0,{"v":8,"d":"$ 8.00"},{"v":8,"d":"$ 8.00"},"CANCELADO",{"$f":"Tabla1442[[#This Row],[VALOR A PAGAR]]-Tabla1442[[#This Row],[VALOR CANCELADO]]","v":0},"CANCELA CON SALDO PENDIENTE DEL TRÁMITE DEL 27-06-2025"]
["2025-07-07","MSA GRAND MASTER",7,{"v":6,"d":"$ 6.00"},{"$f":"C161*Tabla1442[[#This Row],[PRECIO UNITARIO]]","v":{"v":42,"d":"$ 42.00"}},{"v":6,"d":"$ 6.00"},{"v":36,"d":"$ 36.00"},{"v":42,"d":"$ 42.00"},"CANCELADO",{"$f":"Tabla1442[[#This Row],[VALOR A PAGAR]]-Tabla1442[[#This Row],[VALOR CANCELADO]]","v":0},"CANCELA CON 19 CERTIFICADOS DE ASCENSO"]
["2025-07-07","ASOTKD - P (CHIMBACALLE)",1,{"v":8,"d":"$ 8.00"},{"$f":"C162*Tabla1442[[#This Row],[PRECIO UNITARIO]]","v":{"v":8,"d":"$ 8.00"}},{"v":8,"d":"$ 8.00"},0,{"v":8,"d":"$ 8.00"},"CANCELADO",{"$f":"Tabla1442[[#This Row],[VALOR A PAGAR]]-Tabla1442[[#This Row],[VALOR CANCELADO]]","v":0},"CANCELACON REIMPRESIÓN DE 1 DIPLOMA"]
["2025-07-09","CHEN HUU",3,{"v":2,"d":"$ 2.00"},{"$f":"C163*Tabla1442[[#This Row],[PRECIO UNITARIO]]","v":{"v":6,"d":"$ 6.00"}},0,{"v":6,"d":"$ 6.00"},{"v":6,"d":"$ 6.00"},"CANCELADO",{"$f":"Tabla1442[[#This Row],[VALOR A PAGAR]]-Tabla1442[[#This Row],[VALOR CANCELADO]]","v":0},"CANCELA PARA TRÁMITE DE CERTIFICADOS"]
["2025-07-10","SOCIEDAD DEPORTIVA CENTRAL",1,{"v":6,"d":"$ 6.00"},{"$f":"C164*Tabla1442[[#This Row],[PRECIO UNITARIO]]","v":{"v":6,"d":"$ 6.00"}},{"v":6,"d":"$ 6.00"},0,{"v":6,"d":"$ 6.00"},"CANCELADO",{"$f":"Tabla1442[[#This Row],[VALOR A PAGAR]]-Tabla1442[[#This Row],[VALOR CANCELADO]]","v":0},"PARA TRÁMITE DE CERTFICADO CON FECHA 27-04-2024"]
["2025-07-10","FIRST CLASS",2,{"v":8,"d":"$ 8.00"},{"$f":"C165*Tabla1442[[#This Row],[PRECIO UNITARIO]]","v":{"v":16,"d":"$ 16.00"}},0,{"v":16,"d":"$ 16.00"},{"v":16,"d":"$ 16.00"},"CANCELADO",{"$f":"Tabla1442[[#This Row],[VALOR A PAGAR]]-Tabla1442[[#This Row],[VALOR CANCELADO]]","v":0},"PENDIENTE DATOS PARA TRÁMITE"]
["2025-07-11","ASOTKD - P (CHIMBACALLE)",1,{"v":8,"d":"$ 8.00"},{"$f":"C166*Tabla1442[[#This Row],[PRECIO UNITARIO]]","v":{"v":8,"d":"$ 8.00"}},0,{"v":8,"d":"$ 8.00"},{"v":8,"d":"$ 8.00"},"CANCELADO",{"$f":"Tabla1442[[#This Row],[VALOR A PAGAR]]-Tabla1442[[#This Row],[VALOR CANCELADO]]","v":0}]
["2025-07-11","BORJA'S LIONS",4,{"v":8,"d":"$ 8.00"},{"$f":"C167*Tabla1442[[#This Row],[PRECIO UNITARIO]]","v":{"v":32,"d":"$ 32.00"}},0,{"v":32,"d":"$ 32.00"},{"v":32,"d":"$ 32.00"},"CANCELADO",{"$f":"Tabla1442[[#This Row],[VALOR A PAGAR]]-Tabla1442[[#This Row],[VALOR CANCELADO]]","v":0},"CANCELA CON 21 CERTIFICADOS DE ASCENSO"]
["2025-07-16","BAEKJUL TEAM AYALAZ",7,{"v":8,"d":"$ 8.00"},{"$f":"C168*Tabla1442[[#This Row],[PRECIO UNITARIO]]","v":{"v":56,"d":"$ 56.00"}},0,{"v":56,"d":"$ 56.00"},{"v":56,"d":"$ 56.00"},"CANCELADO",{"$f":"Tabla1442[[#This Row],[VALOR A PAGAR]]-Tabla1442[[#This Row],[VALOR CANCELADO]]","v":0}]
["2025-07-17","BAEKJUL TEAM FERNÁNDEZ",2,{"v":8,"d":"$ 8.00"},{"$f":"C169*Tabla1442[[#This Row],[PRECIO UNITARIO]]","v":{"v":16,"d":"$ 16.00"}},0,{"v":16,"d":"$ 16.00"},{"v":16,"d":"$ 16.00"},"CANCELADO",{"$f":"Tabla1442[[#This Row],[VALOR A PAGAR]]-Tabla1442[[#This Row],[VALOR CANCELADO]]","v":0},"CANCELA PARA TRÁMITE DE CERTIFICADOS"]
["2025-07-17","FARANG",1,{"v":8,"d":"$ 8.00"},{"$f":"C170*Tabla1442[[#This Row],[PRECIO UNITARIO]]","v":{"v":8,"d":"$ 8.00"}},0,{"v":8,"d":"$ 8.00"},{"v":8,"d":"$ 8.00"},"CANCELADO",{"$f":"Tabla1442[[#This Row],[VALOR A PAGAR]]-Tabla1442[[#This Row],[VALOR CANCELADO]]","v":0},"CANCELA CON 8 CERTIFICADOS DE ASCENSO"]
["2025-07-23","KO AMÉRICA",2,{"v":6,"d":"$ 6.00"},{"$f":"C171*Tabla1442[[#This Row],[PRECIO UNITARIO]]","v":{"v":12,"d":"$ 12.00"}},0,{"v":12,"d":"$ 12.00"},{"v":12,"d":"$ 12.00"},"CANCELADO",{"$f":"Tabla1442[[#This Row],[VALOR A PAGAR]]-Tabla1442[[#This Row],[VALOR CANCELADO]]","v":0},"CANCELA PARA TRÁMITE DE CERTIFICADOS"]
["2025-07-28","KO AMÉRICA",7,{"v":6,"d":"$ 6.00"},{"$f":"C172*Tabla1442[[#This Row],[PRECIO UNITARIO]]","v":{"v":42,"d":"$ 42.00"}},0,{"v":42,"d":"$ 42.00"},{"v":42,"d":"$ 42.00"},"CANCELADO",{"$f":"Tabla1442[[#This Row],[VALOR A PAGAR]]-Tabla1442[[#This Row],[VALOR CANCELADO]]","v":0},"CANCELA PARA TRÁMITE DE CERTIFICADOS"]
["2025-07-28","DEBAK TKD",5,{"v":8,"d":"$ 8.00"},{"$f":"C173*Tabla1442[[#This Row],[PRECIO UNITARIO]]","v":{"v":40,"d":"$ 40.00"}},0,{"v":40,"d":"$ 40.00"},{"v":40,"d":"$ 40.00"},"CANCELADO",{"$f":"Tabla1442[[#This Row],[VALOR A PAGAR]]-Tabla1442[[#This Row],[VALOR CANCELADO]]","v":0}]
["2025-07-28","DEBAK TKD",1,{"v":2,"d":"$ 2.00"},{"$f":"C174*Tabla1442[[#This Row],[PRECIO UNITARIO]]","v":{"v":2,"d":"$ 2.00"}},0,{"v":2,"d":"$ 2.00"},{"v":2,"d":"$ 2.00"},"CANCELADO",{"$f":"Tabla1442[[#This Row],[VALOR A PAGAR]]-Tabla1442[[#This Row],[VALOR CANCELADO]]","v":0}]
["2025-07-28","TAEBAEK ECUADOR",1,{"v":8,"d":"$ 8.00"},{"$f":"C175*Tabla1442[[#This Row],[PRECIO UNITARIO]]","v":{"v":8,"d":"$ 8.00"}},0,{"v":8,"d":"$ 8.00"},{"v":8,"d":"$ 8.00"},"CANCELADO",{"$f":"Tabla1442[[#This Row],[VALOR A PAGAR]]-Tabla1442[[#This Row],[VALOR CANCELADO]]","v":0}]
["2025-07-29","MARCIAL GRANDA",1,{"v":6,"d":"$ 6.00"},{"$f":"C176*Tabla1442[[#This Row],[PRECIO UNITARIO]]","v":{"v":6,"d":"$ 6.00"}},0,{"v":6,"d":"$ 6.00"},{"v":6,"d":"$ 6.00"},"CANCELADO",{"$f":"Tabla1442[[#This Row],[VALOR A PAGAR]]-Tabla1442[[#This Row],[VALOR CANCELADO]]","v":0}]
["2025-07-30","MARCIAL GRANDA",1,{"v":6,"d":"$ 6.00"},{"$f":"C177*Tabla1442[[#This Row],[PRECIO UNITARIO]]","v":{"v":6,"d":"$ 6.00"}},0,{"v":6,"d":"$ 6.00"},{"v":6,"d":"$ 6.00"},"CANCELADO",{"$f":"Tabla1442[[#This Row],[VALOR A PAGAR]]-Tabla1442[[#This Row],[VALOR CANCELADO]]","v":0}]
["2025-07-30","KUKKIWON",1,{"v":8,"d":"$ 8.00"},{"$f":"C178*Tabla1442[[#This Row],[PRECIO UNITARIO]]","v":{"v":8,"d":"$ 8.00"}},0,{"v":8,"d":"$ 8.00"},{"v":8,"d":"$ 8.00"},"CANCELADO",{"$f":"Tabla1442[[#This Row],[VALOR A PAGAR]]-Tabla1442[[#This Row],[VALOR CANCELADO]]","v":0},"CANCELA CON 9 CERTIFICADOS DE ASCENSO"]
["2025-07-31","TAE SHO KU",1,{"v":2,"d":"$ 2.00"},{"$f":"C179*Tabla1442[[#This Row],[PRECIO UNITARIO]]","v":{"v":2,"d":"$ 2.00"}},0,{"v":2,"d":"$ 2.00"},{"v":2,"d":"$ 2.00"},"CANCELADO",{"$f":"Tabla1442[[#This Row],[VALOR A PAGAR]]-Tabla1442[[#This Row],[VALOR CANCELADO]]","v":0},"SOLO IMPRESIÓN DEL GAL"]
["2025-07-31","ESPE",1,{"v":6,"d":"$ 6.00"},{"$f":"C180*Tabla1442[[#This Row],[PRECIO UNITARIO]]","v":{"v":6,"d":"$ 6.00"}},0,{"v":6,"d":"$ 6.00"},{"v":6,"d":"$ 6.00"},"CANCELADO",{"$f":"Tabla1442[[#This Row],[VALOR A PAGAR]]-Tabla1442[[#This Row],[VALOR CANCELADO]]","v":0}]
["2025-07-31","ESPE",1,{"v":8,"d":"$ 8.00"},{"$f":"C181*Tabla1442[[#This Row],[PRECIO UNITARIO]]","v":{"v":8,"d":"$ 8.00"}},0,{"v":8,"d":"$ 8.00"},{"v":8,"d":"$ 8.00"},"CANCELADO",{"$f":"Tabla1442[[#This Row],[VALOR A PAGAR]]-Tabla1442[[#This Row],[VALOR CANCELADO]]","v":0}]
["2025-07-31","BAS PANTHERS",7,{"v":8,"d":"$ 8.00"},{"$f":"C182*Tabla1442[[#This Row],[PRECIO UNITARIO]]","v":{"v":56,"d":"$ 56.00"}},0,{"v":56,"d":"$ 56.00"},{"v":56,"d":"$ 56.00"},"CANCELADO",{"$f":"Tabla1442[[#This Row],[VALOR A PAGAR]]-Tabla1442[[#This Row],[VALOR CANCELADO]]","v":0},"CANCELA CON 22 CERTIFICADOS DE ASCENSO"]
["2025-08-03","UNIVERSIDAD SAN FRANCISCO DE QUITO",2,{"v":6,"d":"$ 6.00"},{"$f":"C183*Tabla1442[[#This Row],[PRECIO UNITARIO]]","v":{"v":12,"d":"$ 12.00"}},0,{"v":12,"d":"$ 12.00"},{"v":12,"d":"$ 12.00"},"CANCELADO",{"$f":"Tabla1442[[#This Row],[VALOR A PAGAR]]-Tabla1442[[#This Row],[VALOR CANCELADO]]","v":0},"EN  DOS PAGOS"]
["2025-08-05","SEUL CHUNG UI",10,{"v":8,"d":"$ 8.00"},{"$f":"C184*Tabla1442[[#This Row],[PRECIO UNITARIO]]","v":{"v":80,"d":"$ 80.00"}},0,{"v":80,"d":"$ 80.00"},{"v":80,"d":"$ 80.00"},"CANCELADO",{"$f":"Tabla1442[[#This Row],[VALOR A PAGAR]]-Tabla1442[[#This Row],[VALOR CANCELADO]]","v":0},"PARA TRÁMITE DE CERTIFICADOS"]
["2025-08-06","SEUL CAPELO",7,{"v":6,"d":"$ 6.00"},{"$f":"C185*Tabla1442[[#This Row],[PRECIO UNITARIO]]","v":{"v":42,"d":"$ 42.00"}},0,{"v":42,"d":"$ 42.00"},{"v":42,"d":"$ 42.00"},"CANCELADO",{"$f":"Tabla1442[[#This Row],[VALOR A PAGAR]]-Tabla1442[[#This Row],[VALOR CANCELADO]]","v":0},"PARA TRÁMITE DE CERTIFICADOS"]
["2025-08-07","KORYO",1,{"v":8,"d":"$ 8.00"},{"$f":"C186*Tabla1442[[#This Row],[PRECIO UNITARIO]]","v":{"v":8,"d":"$ 8.00"}},0,{"v":8,"d":"$ 8.00"},{"v":8,"d":"$ 8.00"},"CANCELADO",{"$f":"Tabla1442[[#This Row],[VALOR A PAGAR]]-Tabla1442[[#This Row],[VALOR CANCELADO]]","v":0},"CANCELA CON 1 CERTIFICADO DE ASCENSO"]
["2025-08-07","SOCIEDAD DEPORTIVA CENTRAL",6,{"v":6,"d":"$ 6.00"},{"$f":"C187*Tabla1442[[#This Row],[PRECIO UNITARIO]]","v":{"v":36,"d":"$ 36.00"}},{"v":36,"d":"$ 36.00"},0,{"v":36,"d":"$ 36.00"},"CANCELADO",{"$f":"Tabla1442[[#This Row],[VALOR A PAGAR]]-Tabla1442[[#This Row],[VALOR CANCELADO]]","v":0}]
["2025-08-07","YONG TIGER",1,{"v":6,"d":"$ 6.00"},{"$f":"C188*Tabla1442[[#This Row],[PRECIO UNITARIO]]","v":{"v":6,"d":"$ 6.00"}},0,{"v":6,"d":"$ 6.00"},{"v":6,"d":"$ 6.00"},"CANCELADO",{"$f":"Tabla1442[[#This Row],[VALOR A PAGAR]]-Tabla1442[[#This Row],[VALOR CANCELADO]]","v":0},"PAGO REALIZADO EL 03-07-2025 CANCELA PARA REIMPRESIÓN DE CERTIFICADO  DEL 15-12-2018"]
["2025-08-08","LOS PUMAS",2,{"v":6,"d":"$ 6.00"},{"$f":"C189*Tabla1442[[#This Row],[PRECIO UNITARIO]]","v":{"v":12,"d":"$ 12.00"}},0,{"v":12,"d":"$ 12.00"},{"v":12,"d":"$ 12.00"},"CANCELADO",{"$f":"Tabla1442[[#This Row],[VALOR A PAGAR]]-Tabla1442[[#This Row],[VALOR CANCELADO]]","v":0}]
["2025-08-08","FIRST CLASS",1,{"v":8,"d":"$ 8.00"},{"$f":"C190*Tabla1442[[#This Row],[PRECIO UNITARIO]]","v":{"v":8,"d":"$ 8.00"}},0,{"v":8,"d":"$ 8.00"},{"v":8,"d":"$ 8.00"},"CANCELADO",{"$f":"Tabla1442[[#This Row],[VALOR A PAGAR]]-Tabla1442[[#This Row],[VALOR CANCELADO]]","v":0},"CANCELA CON 1 CERTIFICADO DE ASCENSO NO ENVÍA DATOS PARA TRAMITAR"]
["2025-08-08","TAE KING'S",2,{"v":6,"d":"$ 6.00"},{"$f":"C191*Tabla1442[[#This Row],[PRECIO UNITARIO]]","v":{"v":12,"d":"$ 12.00"}},0,{"v":12,"d":"$ 12.00"},{"v":12,"d":"$ 12.00"},"CANCELADO",{"$f":"Tabla1442[[#This Row],[VALOR A PAGAR]]-Tabla1442[[#This Row],[VALOR CANCELADO]]","v":0},"CANCELA CON 2 CERTIFICADOS DE ASCENSO"]
["2025-08-12","BAS PANTHERS",1,{"v":2,"d":"$ 2.00"},{"$f":"C192*Tabla1442[[#This Row],[PRECIO UNITARIO]]","v":{"v":2,"d":"$ 2.00"}},0,{"v":2,"d":"$ 2.00"},{"v":2,"d":"$ 2.00"},"CANCELADO",{"$f":"Tabla1442[[#This Row],[VALOR A PAGAR]]-Tabla1442[[#This Row],[VALOR CANCELADO]]","v":0},"REIMPRESIÓN"]
["2025-08-12","BORJA'S LIONS",1,{"v":8,"d":"$ 8.00"},{"$f":"C193*Tabla1442[[#This Row],[PRECIO UNITARIO]]","v":{"v":8,"d":"$ 8.00"}},0,{"v":8,"d":"$ 8.00"},{"v":8,"d":"$ 8.00"},"CANCELADO",{"$f":"Tabla1442[[#This Row],[VALOR A PAGAR]]-Tabla1442[[#This Row],[VALOR CANCELADO]]","v":0}]
["2025-08-12","BORJA'S LIONS",1,{"v":2,"d":"$ 2.00"},{"$f":"C194*Tabla1442[[#This Row],[PRECIO UNITARIO]]","v":{"v":2,"d":"$ 2.00"}},0,{"v":2,"d":"$ 2.00"},{"v":2,"d":"$ 2.00"},"CANCELADO",{"$f":"Tabla1442[[#This Row],[VALOR A PAGAR]]-Tabla1442[[#This Row],[VALOR CANCELADO]]","v":0}]
["2025-08-14","MICHAYDO",9,{"v":8,"d":"$ 8.00"},{"$f":"C195*Tabla1442[[#This Row],[PRECIO UNITARIO]]","v":{"v":72,"d":"$ 72.00"}},0,{"v":72,"d":"$ 72.00"},{"v":72,"d":"$ 72.00"},"CANCELADO",{"$f":"Tabla1442[[#This Row],[VALOR A PAGAR]]-Tabla1442[[#This Row],[VALOR CANCELADO]]","v":0},"PARA TRÁMITE DE CERTIFICADOS 07-08-2025"]
["2025-08-18","MIKIDO",5,{"v":8,"d":"$ 8.00"},{"$f":"C196*Tabla1442[[#This Row],[PRECIO UNITARIO]]","v":{"v":40,"d":"$ 40.00"}},0,{"v":40,"d":"$ 40.00"},{"$f":"F196+G196","v":{"v":40,"d":"$ 40.00"}},{"$f":"IF((E196=H196),\"CANCELADO\",\"SALDO PENDIENTE\")","v":"CANCELADO"},{"$f":"Tabla1442[[#This Row],[VALOR A PAGAR]]-Tabla1442[[#This Row],[VALOR CANCELADO]]","v":0},"CANCELA CON 14 CERTIFICADOS DE ASCENSO"]
["2025-08-18","ARES",12,{"v":8,"d":"$ 8.00"},{"$f":"C197*Tabla1442[[#This Row],[PRECIO UNITARIO]]","v":{"v":96,"d":"$ 96.00"}},0,{"v":96,"d":"$ 96.00"},{"v":96,"d":"$ 96.00"},"CANCELADO",{"$f":"Tabla1442[[#This Row],[VALOR A PAGAR]]-Tabla1442[[#This Row],[VALOR CANCELADO]]","v":0}]
["2025-08-19","DRACO",9,{"v":6,"d":"$ 6.00"},{"$f":"C198*Tabla1442[[#This Row],[PRECIO UNITARIO]]","v":{"v":54,"d":"$ 54.00"}},0,{"v":54,"d":"$ 54.00"},{"v":54,"d":"$ 54.00"},"CANCELADO",{"$f":"Tabla1442[[#This Row],[VALOR A PAGAR]]-Tabla1442[[#This Row],[VALOR CANCELADO]]","v":0}]
["2025-08-19","DRACO",2,{"v":2,"d":"$ 2.00"},{"$f":"C199*Tabla1442[[#This Row],[PRECIO UNITARIO]]","v":{"v":4,"d":"$ 4.00"}},0,{"v":4,"d":"$ 4.00"},{"v":4,"d":"$ 4.00"},"CANCELADO",{"$f":"Tabla1442[[#This Row],[VALOR A PAGAR]]-Tabla1442[[#This Row],[VALOR CANCELADO]]","v":0}]
["2025-08-21","BORJA'S LIONS",4,{"v":8,"d":"$ 8.00"},{"$f":"C200*Tabla1442[[#This Row],[PRECIO UNITARIO]]","v":{"v":32,"d":"$ 32.00"}},0,{"v":32,"d":"$ 32.00"},{"v":32,"d":"$ 32.00"},"CANCELADO",{"$f":"Tabla1442[[#This Row],[VALOR A PAGAR]]-Tabla1442[[#This Row],[VALOR CANCELADO]]","v":0},"CANCELA CON 4 CERTIFICADOS DE ASCENSO"]
["2025-08-25","BAEKJUL",4,{"v":8,"d":"$ 8.00"},{"$f":"C201*Tabla1442[[#This Row],[PRECIO UNITARIO]]","v":{"v":32,"d":"$ 32.00"}},0,{"v":32,"d":"$ 32.00"},{"v":32,"d":"$ 32.00"},"CANCELADO",{"$f":"Tabla1442[[#This Row],[VALOR A PAGAR]]-Tabla1442[[#This Row],[VALOR CANCELADO]]","v":0},"CANCELA CON 40 CERTIFICADOS DE ASCENSO"]
["2025-08-25","KUMGANG DUL",2,{"v":6,"d":"$ 6.00"},{"$f":"C202*Tabla1442[[#This Row],[PRECIO UNITARIO]]","v":{"v":12,"d":"$ 12.00"}},0,{"v":12,"d":"$ 12.00"},{"v":12,"d":"$ 12.00"},"CANCELADO",{"$f":"Tabla1442[[#This Row],[VALOR A PAGAR]]-Tabla1442[[#This Row],[VALOR CANCELADO]]","v":0}]
["2025-08-25","KUMGANG DUL",1,{"v":8,"d":"$ 8.00"},{"$f":"C203*Tabla1442[[#This Row],[PRECIO UNITARIO]]","v":{"v":8,"d":"$ 8.00"}},0,{"v":8,"d":"$ 8.00"},{"v":8,"d":"$ 8.00"},"CANCELADO",{"$f":"Tabla1442[[#This Row],[VALOR A PAGAR]]-Tabla1442[[#This Row],[VALOR CANCELADO]]","v":0}]
["2025-08-28","BORJA'S LIONS",4,{"v":8,"d":"$ 8.00"},{"$f":"C204*Tabla1442[[#This Row],[PRECIO UNITARIO]]","v":{"v":32,"d":"$ 32.00"}},0,{"v":32,"d":"$ 32.00"},{"v":32,"d":"$ 32.00"},"CANCELADO",{"$f":"Tabla1442[[#This Row],[VALOR A PAGAR]]-Tabla1442[[#This Row],[VALOR CANCELADO]]","v":0},"FALTAN FOTOS PARA TRÁMITE"]
["2025-08-28","DEBAK TKD",1,{"v":8,"d":"$ 8.00"},{"$f":"C205*Tabla1442[[#This Row],[PRECIO UNITARIO]]","v":{"v":8,"d":"$ 8.00"}},0,{"v":8,"d":"$ 8.00"},{"v":8,"d":"$ 8.00"},"CANCELADO",{"$f":"Tabla1442[[#This Row],[VALOR A PAGAR]]-Tabla1442[[#This Row],[VALOR CANCELADO]]","v":0}]
[null,"TOTAL",{"$f":"SUM(C4:C205)","v":920},null,{"$f":"SUBTOTAL(109,Tabla1442[VALOR A PAGAR])","v":{"v":6266,"d":"$6,266.00"}},{"$f":"SUM(F4:F205)","v":{"v":602,"d":"$602.00"}},{"$f":"SUM(G4:G205)","v":{"v":5662,"d":"$5,662.00"}},{"$f":"SUM(H4:H205)","v":{"v":6264,"d":"$6,264.00"}}]
[null,null,"GAL ELABORADOS",null,"A RECAUDARSE","RECAUDADO EN EFECTIVO","RECAUDADO EN TRANSFERENCIA"]
[]
[]
[null,"RECAUDADO","MONTO"]
[null,"EFECTIVO",{"$f":"F206","v":{"v":602,"d":"$602.00"}}]
[null,"TRANSFERENCIA",{"$f":"G206","v":{"v":5662,"d":"$5,662.00"}}]
[null,"TOTAL",{"$f":"SUM(C211:C212)","v":{"v":6264,"d":"$6,264.00"}}]
[]
[]
[null,"POR COBRAR","MONTO"]
[null,"NINGUNO"]
[null,"TOTAL",{"$f":"SUM(C217:C217)","v":{"v":0,"d":"$0.00"}}]
[]
[]
[null,"DEVOLVER O HACER PASO","MONTO"]
[null,{"$f":"B39","v":"YONG TIGER"},{"v":12,"d":"$12.00"}]
[null,{"$f":"B83","v":"PALADINS MARCIAL CLUB"},{"v":16,"d":"$16.00"}]
[null,{"$f":"B119","v":"KUMGANG DUL"},{"v":2,"d":"$2.00"}]
[null,{"$f":"B183","v":"UNIVERSIDAD SAN FRANCISCO DE QUITO"},{"v":2,"d":"$2.00"}]
[null,"TOTAL",{"$f":"SUM(C222:C225)","v":{"v":32,"d":"$32.00"}}]
{"$rows_empty":1353}
[null,null,"BENJAMIN MATIAS "]

{"sheet":"CERTIFICADOS DE ASCENSO 2025","index":4,"n_rows":135,"n_cols":13,"rows_kept":135,"merged":[[0,0,1,10],[114,0,114,1]]}
["CERTIFICADOS DE ASCENSO (16 DE MARZO 2025 AL 05 SEPTIEMBRE 2025)"]
[]
["FECHA","CLUB","CANT.","PRECIO UNITARIO","VALOR A PAGAR","EFECTIVO","TRANSFERENCIA","VALOR CANCELADO","ESTADO","SALDO","OBSERVACIONES"]
["2025-03-19","HANSU",143,{"v":2.5,"d":"$ 2.50"},{"$f":"Tabla1425[[#This Row],[CANT.]]*Tabla1425[[#This Row],[PRECIO UNITARIO]]","v":{"v":357.5,"d":"$357.50"}},{"v":357.5,"d":"$ 357.50"},0,{"$f":"Tabla1425[[#This Row],[EFECTIVO]]+Tabla1425[[#This Row],[TRANSFERENCIA]]","v":{"v":357.5,"d":"$ 357.50"}},{"$f":"IF((E4=H4),\"CANCELADO\",\"SALDO PENDIENTE\")","v":"CANCELADO"},{"$f":"Tabla1425[[#This Row],[VALOR A PAGAR]]-Tabla1425[[#This Row],[VALOR CANCELADO]]","v":0}]
["2025-03-20","UTE",11,{"v":2.5,"d":"$ 2.50"},{"$f":"Tabla1425[[#This Row],[CANT.]]*Tabla1425[[#This Row],[PRECIO UNITARIO]]","v":{"v":27.5,"d":"$27.50"}},0,{"v":27.5,"d":"$ 27.50"},{"$f":"Tabla1425[[#This Row],[EFECTIVO]]+Tabla1425[[#This Row],[TRANSFERENCIA]]","v":{"v":27.5,"d":"$ 27.50"}},"CANCELADO",{"$f":"Tabla1425[[#This Row],[VALOR A PAGAR]]-Tabla1425[[#This Row],[VALOR CANCELADO]]","v":0}]
["2025-03-20","UNIVERSIDAD UTE",11,{"v":2.5,"d":"$ 2.50"},{"$f":"Tabla1425[[#This Row],[CANT.]]*Tabla1425[[#This Row],[PRECIO UNITARIO]]","v":{"v":27.5,"d":"$27.50"}},0,{"v":27.5,"d":"$ 27.50"},{"$f":"Tabla1425[[#This Row],[EFECTIVO]]+Tabla1425[[#This Row],[TRANSFERENCIA]]","v":{"v":27.5,"d":"$ 27.50"}},"CANCELADO",{"$f":"Tabla1425[[#This Row],[VALOR A PAGAR]]-Tabla1425[[#This Row],[VALOR CANCELADO]]","v":0}]
["2025-03-20","KORYO",1,{"v":2.5,"d":"$ 2.50"},{"$f":"Tabla1425[[#This Row],[CANT.]]*Tabla1425[[#This Row],[PRECIO UNITARIO]]","v":{"v":2.5,"d":"$2.50"}},0,{"v":2.5,"d":"$ 2.50"},{"$f":"Tabla1425[[#This Row],[EFECTIVO]]+Tabla1425[[#This Row],[TRANSFERENCIA]]","v":{"v":2.5,"d":"$ 2.50"}},"CANCELADO",{"$f":"Tabla1425[[#This Row],[VALOR A PAGAR]]-Tabla1425[[#This Row],[VALOR CANCELADO]]","v":0}]
["2025-03-21","GOYANG - IDEUL",1,{"v":2.5,"d":"$ 2.50"},{"$f":"Tabla1425[[#This Row],[CANT.]]*Tabla1425[[#This Row],[PRECIO UNITARIO]]","v":{"v":2.5,"d":"$2.50"}},0,{"v":2.5,"d":"$ 2.50"},{"$f":"Tabla1425[[#This Row],[EFECTIVO]]+Tabla1425[[#This Row],[TRANSFERENCIA]]","v":{"v":2.5,"d":"$ 2.50"}},"CANCELADO",{"$f":"Tabla1425[[#This Row],[VALOR A PAGAR]]-Tabla1425[[#This Row],[VALOR CANCELADO]]","v":0}]
["2025-03-21","CIUDAD DE QUITO",13,{"v":2.5,"d":"$ 2.50"},{"$f":"Tabla1425[[#This Row],[CANT.]]*Tabla1425[[#This Row],[PRECIO UNITARIO]]","v":{"v":32.5,"d":"$32.50"}},0,{"v":32.5,"d":"$ 32.50"},{"$f":"Tabla1425[[#This Row],[EFECTIVO]]+Tabla1425[[#This Row],[TRANSFERENCIA]]","v":{"v":32.5,"d":"$ 32.50"}},"CANCELADO",{"$f":"Tabla1425[[#This Row],[VALOR A PAGAR]]-Tabla1425[[#This Row],[VALOR CANCELADO]]","v":0}]
["2025-03-21","DRAGON GYM",34,{"v":2.5,"d":"$ 2.50"},{"$f":"Tabla1425[[#This Row],[CANT.]]*Tabla1425[[#This Row],[PRECIO UNITARIO]]","v":{"v":85,"d":"$85.00"}},0,{"v":85,"d":"$ 85.00"},{"$f":"Tabla1425[[#This Row],[EFECTIVO]]+Tabla1425[[#This Row],[TRANSFERENCIA]]","v":{"v":85,"d":"$ 85.00"}},"CANCELADO",{"$f":"Tabla1425[[#This Row],[VALOR A PAGAR]]-Tabla1425[[#This Row],[VALOR CANCELADO]]","v":0},"CANCELA CON  2 GAL'S IMPRESOS"]
["2025-03-24","EQUILIBRIO",14,{"v":2.5,"d":"$ 2.50"},{"$f":"Tabla1425[[#This Row],[CANT.]]*Tabla1425[[#This Row],[PRECIO UNITARIO]]","v":{"v":35,"d":"$35.00"}},0,{"v":35,"d":"$ 35.00"},{"$f":"Tabla1425[[#This Row],[EFECTIVO]]+Tabla1425[[#This Row],[TRANSFERENCIA]]","v":{"v":35,"d":"$ 35.00"}},"CANCELADO",{"$f":"Tabla1425[[#This Row],[VALOR A PAGAR]]-Tabla1425[[#This Row],[VALOR CANCELADO]]","v":0},"CANCELA CON  4 GAL'S IMPRESOS"]
["2025-03-27","BAEKJUL TEAM AYALAZ",3,{"v":2.5,"d":"$ 2.50"},{"$f":"Tabla1425[[#This Row],[CANT.]]*Tabla1425[[#This Row],[PRECIO UNITARIO]]","v":{"v":7.5,"d":"$7.50"}},0,{"v":7.5,"d":"$ 7.50"},{"$f":"Tabla1425[[#This Row],[EFECTIVO]]+Tabla1425[[#This Row],[TRANSFERENCIA]]","v":{"v":7.5,"d":"$ 7.50"}},"CANCELADO",{"$f":"Tabla1425[[#This Row],[VALOR A PAGAR]]-Tabla1425[[#This Row],[VALOR CANCELADO]]","v":0}]
["2025-03-31","MIKIDO",18,{"v":2.5,"d":"$ 2.50"},{"$f":"Tabla1425[[#This Row],[CANT.]]*Tabla1425[[#This Row],[PRECIO UNITARIO]]","v":{"v":45,"d":"$45.00"}},0,{"v":45,"d":"$ 45.00"},{"$f":"Tabla1425[[#This Row],[EFECTIVO]]+Tabla1425[[#This Row],[TRANSFERENCIA]]","v":{"v":45,"d":"$ 45.00"}},"CANCELADO",{"$f":"Tabla1425[[#This Row],[VALOR A PAGAR]]-Tabla1425[[#This Row],[VALOR CANCELADO]]","v":0}]
["2025-03-31","ARES",1,{"v":2.5,"d":"$ 2.50"},{"$f":"Tabla1425[[#This Row],[CANT.]]*Tabla1425[[#This Row],[PRECIO UNITARIO]]","v":{"v":2.5,"d":"$2.50"}},0,{"v":2.5,"d":"$ 2.50"},{"$f":"Tabla1425[[#This Row],[EFECTIVO]]+Tabla1425[[#This Row],[TRANSFERENCIA]]","v":{"v":2.5,"d":"$ 2.50"}},"CANCELADO",{"$f":"Tabla1425[[#This Row],[VALOR A PAGAR]]-Tabla1425[[#This Row],[VALOR CANCELADO]]","v":0}]
["2025-03-31","CHUNG SONG",3,{"v":2.5,"d":"$ 2.50"},{"$f":"Tabla1425[[#This Row],[CANT.]]*Tabla1425[[#This Row],[PRECIO UNITARIO]]","v":{"v":7.5,"d":"$7.50"}},0,{"v":7.5,"d":"$ 7.50"},{"$f":"Tabla1425[[#This Row],[EFECTIVO]]+Tabla1425[[#This Row],[TRANSFERENCIA]]","v":{"v":7.5,"d":"$ 7.50"}},"CANCELADO",{"$f":"Tabla1425[[#This Row],[VALOR A PAGAR]]-Tabla1425[[#This Row],[VALOR CANCELADO]]","v":0}]
["2025-03-31","KUMGANG DUL",26,{"v":2.5,"d":"$ 2.50"},{"$f":"Tabla1425[[#This Row],[CANT.]]*Tabla1425[[#This Row],[PRECIO UNITARIO]]","v":{"v":65,"d":"$65.00"}},0,{"v":65,"d":"$ 65.00"},{"$f":"Tabla1425[[#This Row],[EFECTIVO]]+Tabla1425[[#This Row],[TRANSFERENCIA]]","v":{"v":65,"d":"$ 65.00"}},"CANCELADO",{"$f":"Tabla1425[[#This Row],[VALOR A PAGAR]]-Tabla1425[[#This Row],[VALOR CANCELADO]]","v":0}]
["2025-04-01","ECUADOR",20,{"v":2.5,"d":"$ 2.50"},{"$f":"Tabla1425[[#This Row],[CANT.]]*Tabla1425[[#This Row],[PRECIO UNITARIO]]","v":{"v":50,"d":"$50.00"}},0,{"v":50,"d":"$ 50.00"},{"$f":"Tabla1425[[#This Row],[EFECTIVO]]+Tabla1425[[#This Row],[TRANSFERENCIA]]","v":{"v":50,"d":"$ 50.00"}},"CANCELADO",{"$f":"Tabla1425[[#This Row],[VALOR A PAGAR]]-Tabla1425[[#This Row],[VALOR CANCELADO]]","v":0},"CANCELA CON  2 GAL'S DIGITALES"]
["2025-04-04","FITTKWONDO MEJÍA",2,{"v":2.5,"d":"$ 2.50"},{"$f":"Tabla1425[[#This Row],[CANT.]]*Tabla1425[[#This Row],[PRECIO UNITARIO]]","v":{"v":5,"d":"$5.00"}},0,{"v":5,"d":"$ 5.00"},{"$f":"Tabla1425[[#This Row],[EFECTIVO]]+Tabla1425[[#This Row],[TRANSFERENCIA]]","v":{"v":5,"d":"$ 5.00"}},"CANCELADO",{"$f":"Tabla1425[[#This Row],[VALOR A PAGAR]]-Tabla1425[[#This Row],[VALOR CANCELADO]]","v":0}]
["2025-04-04","BORJA'S LIONS",25,{"v":2.5,"d":"$ 2.50"},{"$f":"Tabla1425[[#This Row],[CANT.]]*Tabla1425[[#This Row],[PRECIO UNITARIO]]","v":{"v":62.5,"d":"$62.50"}},0,{"v":62.5,"d":"$ 62.50"},{"$f":"Tabla1425[[#This Row],[EFECTIVO]]+Tabla1425[[#This Row],[TRANSFERENCIA]]","v":{"v":62.5,"d":"$ 62.50"}},"CANCELADO",{"$f":"Tabla1425[[#This Row],[VALOR A PAGAR]]-Tabla1425[[#This Row],[VALOR CANCELADO]]","v":0},"CANCELA CON  25 GAL'S DIGITALES"]
["2025-04-07","SEUL",1,{"v":2.5,"d":"$ 2.50"},{"$f":"Tabla1425[[#This Row],[CANT.]]*Tabla1425[[#This Row],[PRECIO UNITARIO]]","v":{"v":2.5,"d":"$2.50"}},{"v":2.5,"d":"$ 2.50"},0,{"$f":"Tabla1425[[#This Row],[EFECTIVO]]+Tabla1425[[#This Row],[TRANSFERENCIA]]","v":{"v":2.5,"d":"$ 2.50"}},"CANCELADO",{"$f":"Tabla1425[[#This Row],[VALOR A PAGAR]]-Tabla1425[[#This Row],[VALOR CANCELADO]]","v":0}]
["2025-04-07","ASOTKD - P (VICENTINA)",2,{"v":2.5,"d":"$ 2.50"},{"$f":"Tabla1425[[#This Row],[CANT.]]*Tabla1425[[#This Row],[PRECIO UNITARIO]]","v":{"v":5,"d":"$5.00"}},{"v":5,"d":"$ 5.00"},0,{"$f":"Tabla1425[[#This Row],[EFECTIVO]]+Tabla1425[[#This Row],[TRANSFERENCIA]]","v":{"v":5,"d":"$ 5.00"}},"CANCELADO",{"$f":"Tabla1425[[#This Row],[VALOR A PAGAR]]-Tabla1425[[#This Row],[VALOR CANCELADO]]","v":0}]
["2025-04-08","TAE WOONG",2,{"v":2.5,"d":"$ 2.50"},{"$f":"Tabla1425[[#This Row],[CANT.]]*Tabla1425[[#This Row],[PRECIO UNITARIO]]","v":{"v":5,"d":"$5.00"}},0,{"v":5,"d":"$ 5.00"},{"$f":"Tabla1425[[#This Row],[EFECTIVO]]+Tabla1425[[#This Row],[TRANSFERENCIA]]","v":{"v":5,"d":"$ 5.00"}},"CANCELADO",{"$f":"Tabla1425[[#This Row],[VALOR A PAGAR]]-Tabla1425[[#This Row],[VALOR CANCELADO]]","v":0},"CANCELA CON  10 GAL'S IMPRESOS Y 1 SOLO IMPRESIÓN"]
["2025-04-09","CAMU",20,{"v":2.5,"d":"$ 2.50"},{"$f":"Tabla1425[[#This Row],[CANT.]]*Tabla1425[[#This Row],[PRECIO UNITARIO]]","v":{"v":50,"d":"$50.00"}},0,{"v":50,"d":"$ 50.00"},{"$f":"Tabla1425[[#This Row],[EFECTIVO]]+Tabla1425[[#This Row],[TRANSFERENCIA]]","v":{"v":50,"d":"$ 50.00"}},"CANCELADO",{"$f":"Tabla1425[[#This Row],[VALOR A PAGAR]]-Tabla1425[[#This Row],[VALOR CANCELADO]]","v":0},"CANCELA CON  12 GAL'S IMPRESOS"]
["2025-04-14","KUKKIWON",8,{"v":2.5,"d":"$ 2.50"},{"$f":"Tabla1425[[#This Row],[CANT.]]*Tabla1425[[#This Row],[PRECIO UNITARIO]]","v":{"v":20,"d":"$20.00"}},0,{"v":20,"d":"$ 20.00"},{"$f":"Tabla1425[[#This Row],[EFECTIVO]]+Tabla1425[[#This Row],[TRANSFERENCIA]]","v":{"v":20,"d":"$ 20.00"}},"CANCELADO",{"$f":"Tabla1425[[#This Row],[VALOR A PAGAR]]-Tabla1425[[#This Row],[VALOR CANCELADO]]","v":0}]
["2025-04-16","ASOTKD - P CHIMBACALLE",2,{"v":2.5,"d":"$ 2.50"},{"$f":"Tabla1425[[#This Row],[CANT.]]*Tabla1425[[#This Row],[PRECIO UNITARIO]]","v":{"v":5,"d":"$5.00"}},{"v":5,"d":"$ 5.00"},0,{"$f":"Tabla1425[[#This Row],[EFECTIVO]]+Tabla1425[[#This Row],[TRANSFERENCIA]]","v":{"v":5,"d":"$ 5.00"}},"CANCELADO",{"$f":"Tabla1425[[#This Row],[VALOR A PAGAR]]-Tabla1425[[#This Row],[VALOR CANCELADO]]","v":0}]
["2025-04-21","MICHAY DO",2,{"v":2.5,"d":"$ 2.50"},{"$f":"Tabla1425[[#This Row],[CANT.]]*Tabla1425[[#This Row],[PRECIO UNITARIO]]","v":{"v":5,"d":"$5.00"}},0,{"v":5,"d":"$ 5.00"},{"$f":"Tabla1425[[#This Row],[EFECTIVO]]+Tabla1425[[#This Row],[TRANSFERENCIA]]","v":{"v":5,"d":"$ 5.00"}},"CANCELADO",{"$f":"Tabla1425[[#This Row],[VALOR A PAGAR]]-Tabla1425[[#This Row],[VALOR CANCELADO]]","v":0},"CANCELA CON  1 GAL IMPRESO"]
["2025-04-22","CHUNG SONG",34,{"v":2.5,"d":"$ 2.50"},{"$f":"Tabla1425[[#This Row],[CANT.]]*Tabla1425[[#This Row],[PRECIO UNITARIO]]","v":{"v":85,"d":"$85.00"}},0,{"v":85,"d":"$ 85.00"},{"$f":"Tabla1425[[#This Row],[EFECTIVO]]+Tabla1425[[#This Row],[TRANSFERENCIA]]","v":{"v":85,"d":"$ 85.00"}},"CANCELADO",{"$f":"Tabla1425[[#This Row],[VALOR A PAGAR]]-Tabla1425[[#This Row],[VALOR CANCELADO]]","v":0},"CANCELA CON  2 GAL DIGITAL"]
["2025-04-22","ARES",24,{"v":2.5,"d":"$ 2.50"},{"$f":"Tabla1425[[#This Row],[CANT.]]*Tabla1425[[#This Row],[PRECIO UNITARIO]]","v":{"v":60,"d":"$60.00"}},{"v":60,"d":"$ 60.00"},0,{"$f":"Tabla1425[[#This Row],[EFECTIVO]]+Tabla1425[[#This Row],[TRANSFERENCIA]]","v":{"v":60,"d":"$ 60.00"}},"CANCELADO",{"$f":"Tabla1425[[#This Row],[VALOR A PAGAR]]-Tabla1425[[#This Row],[VALOR CANCELADO]]","v":0}]
["2025-04-22","DRAGON LEE GYM",1,{"v":2.5,"d":"$ 2.50"},{"$f":"Tabla1425[[#This Row],[CANT.]]*Tabla1425[[#This Row],[PRECIO UNITARIO]]","v":{"v":2.5,"d":"$2.50"}},0,{"v":2.5,"d":"$ 2.50"},{"$f":"Tabla1425[[#This Row],[EFECTIVO]]+Tabla1425[[#This Row],[TRANSFERENCIA]]","v":{"v":2.5,"d":"$ 2.50"}},"CANCELADO",{"$f":"Tabla1425[[#This Row],[VALOR A PAGAR]]-Tabla1425[[#This Row],[VALOR CANCELADO]]","v":0},"CANCELA CON  1 GAL IMPRESO"]
["2025-04-24","BAEKJUL TEAM FERNÁNDEZ",4,{"v":2.5,"d":"$ 2.50"},{"$f":"Tabla1425[[#This Row],[CANT.]]*Tabla1425[[#This Row],[PRECIO UNITARIO]]","v":{"v":10,"d":"$10.00"}},0,{"v":10,"d":"$ 10.00"},{"$f":"Tabla1425[[#This Row],[EFECTIVO]]+Tabla1425[[#This Row],[TRANSFERENCIA]]","v":{"v":10,"d":"$ 10.00"}},"CANCELADO",{"$f":"Tabla1425[[#This Row],[VALOR A PAGAR]]-Tabla1425[[#This Row],[VALOR CANCELADO]]","v":0}]
["2025-04-24","KORYO",10,{"v":2.5,"d":"$ 2.50"},{"$f":"Tabla1425[[#This Row],[CANT.]]*Tabla1425[[#This Row],[PRECIO UNITARIO]]","v":{"v":25,"d":"$25.00"}},0,{"v":25,"d":"$ 25.00"},{"$f":"Tabla1425[[#This Row],[EFECTIVO]]+Tabla1425[[#This Row],[TRANSFERENCIA]]","v":{"v":25,"d":"$ 25.00"}},"CANCELADO",{"$f":"Tabla1425[[#This Row],[VALOR A PAGAR]]-Tabla1425[[#This Row],[VALOR CANCELADO]]","v":0},"CANCELA CON  10 GAL'S IMPRESOS"]
["2025-04-25","TAE DO ACADEMY",41,{"v":2.5,"d":"$ 2.50"},{"$f":"Tabla1425[[#This Row],[CANT.]]*Tabla1425[[#This Row],[PRECIO UNITARIO]]","v":{"v":102.5,"d":"$102.50"}},0,{"v":102.5,"d":"$ 102.50"},{"$f":"Tabla1425[[#This Row],[EFECTIVO]]+Tabla1425[[#This Row],[TRANSFERENCIA]]","v":{"v":102.5,"d":"$ 102.50"}},"CANCELADO",{"$f":"Tabla1425[[#This Row],[VALOR A PAGAR]]-Tabla1425[[#This Row],[VALOR CANCELADO]]","v":0},"ENVÍA PAGO DE 42 CERTIFICADOS Y EN LISTA CONSTAN 41 TIENE UN SALDO A FAVOR"]
["2025-04-29","DRAGON GYM",1,{"v":2.5,"d":"$ 2.50"},{"$f":"Tabla1425[[#This Row],[CANT.]]*Tabla1425[[#This Row],[PRECIO UNITARIO]]","v":{"v":2.5,"d":"$2.50"}},0,{"v":2.5,"d":"$ 2.50"},{"$f":"Tabla1425[[#This Row],[EFECTIVO]]+Tabla1425[[#This Row],[TRANSFERENCIA]]","v":{"v":2.5,"d":"$ 2.50"}},"CANCELADO",{"$f":"Tabla1425[[#This Row],[VALOR A PAGAR]]-Tabla1425[[#This Row],[VALOR CANCELADO]]","v":0},"REIMPRESIÓN DE DIPLOMA "]
["2025-04-30","ESPE",7,{"v":2.5,"d":"$ 2.50"},{"$f":"Tabla1425[[#This Row],[CANT.]]*Tabla1425[[#This Row],[PRECIO UNITARIO]]","v":{"v":17.5,"d":"$17.50"}},0,{"v":17.5,"d":"$ 17.50"},{"$f":"Tabla1425[[#This Row],[EFECTIVO]]+Tabla1425[[#This Row],[TRANSFERENCIA]]","v":{"v":17.5,"d":"$ 17.50"}},"CANCELADO",{"$f":"Tabla1425[[#This Row],[VALOR A PAGAR]]-Tabla1425[[#This Row],[VALOR CANCELADO]]","v":0},"CRUCE DEUDA TRÁMITES EN SRI DE ASOTKDP POR EDUARDO LOACHAMÍN"]
["2025-05-05","VILL GYM",13,{"v":2.5,"d":"$ 2.50"},{"$f":"Tabla1425[[#This Row],[CANT.]]*Tabla1425[[#This Row],[PRECIO UNITARIO]]","v":{"v":32.5,"d":"$32.50"}},0,{"v":32.5,"d":"$ 32.50"},{"$f":"Tabla1425[[#This Row],[EFECTIVO]]+Tabla1425[[#This Row],[TRANSFERENCIA]]","v":{"v":32.5,"d":"$ 32.50"}},"CANCELADO",{"$f":"Tabla1425[[#This Row],[VALOR A PAGAR]]-Tabla1425[[#This Row],[VALOR CANCELADO]]","v":0},"CANCELA CON  10 GAL'S IMPRESOS"]
["2025-05-05","JERATHEL",21,{"v":2.5,"d":"$ 2.50"},{"$f":"Tabla1425[[#This Row],[CANT.]]*Tabla1425[[#This Row],[PRECIO UNITARIO]]","v":{"v":52.5,"d":"$52.50"}},0,{"v":52.5,"d":"$ 52.50"},{"$f":"Tabla1425[[#This Row],[EFECTIVO]]+Tabla1425[[#This Row],[TRANSFERENCIA]]","v":{"v":52.5,"d":"$ 52.50"}},{"$f":"IF((E36=H36),\"CANCELADO\",\"SALDO PENDIENTE\")","v":"CANCELADO"},{"$f":"Tabla1425[[#This Row],[VALOR A PAGAR]]-Tabla1425[[#This Row],[VALOR CANCELADO]]","v":0},"HACE USO DE SALDO A FAVOR DISPONIBLE DEL TRÁMITE DEL 11-02-2025"]
["2025-05-06","RAIG DE LLUM",19,{"v":2.5,"d":"$ 2.50"},{"$f":"Tabla1425[[#This Row],[CANT.]]*Tabla1425[[#This Row],[PRECIO UNITARIO]]","v":{"v":47.5,"d":"$47.50"}},0,{"v":47.5,"d":"$ 47.50"},{"$f":"Tabla1425[[#This Row],[EFECTIVO]]+Tabla1425[[#This Row],[TRANSFERENCIA]]","v":{"v":47.5,"d":"$ 47.50"}},"CANCELADO",{"$f":"Tabla1425[[#This Row],[VALOR A PAGAR]]-Tabla1425[[#This Row],[VALOR CANCELADO]]","v":0},"CANCELA CON 9 GAL'S IMPRESOS"]
["2025-05-07","BAS PANTHERS",29,{"v":2.5,"d":"$ 2.50"},{"$f":"Tabla1425[[#This Row],[CANT.]]*Tabla1425[[#This Row],[PRECIO UNITARIO]]","v":{"v":72.5,"d":"$72.50"}},0,{"v":72.5,"d":"$ 72.50"},{"$f":"Tabla1425[[#This Row],[EFECTIVO]]+Tabla1425[[#This Row],[TRANSFERENCIA]]","v":{"v":72.5,"d":"$ 72.50"}},"CANCELADO",{"$f":"Tabla1425[[#This Row],[VALOR A PAGAR]]-Tabla1425[[#This Row],[VALOR CANCELADO]]","v":0},"CANCELA CON  3 GAL'S IMPRESOS"]
["2025-05-07","LEÓN",24,{"v":2.5,"d":"$ 2.50"},{"$f":"Tabla1425[[#This Row],[CANT.]]*Tabla1425[[#This Row],[PRECIO UNITARIO]]","v":{"v":60,"d":"$60.00"}},0,{"v":60,"d":"$ 60.00"},{"$f":"Tabla1425[[#This Row],[EFECTIVO]]+Tabla1425[[#This Row],[TRANSFERENCIA]]","v":{"v":60,"d":"$ 60.00"}},"CANCELADO",{"$f":"Tabla1425[[#This Row],[VALOR A PAGAR]]-Tabla1425[[#This Row],[VALOR CANCELADO]]","v":0}]
["2025-05-09","MOODUKKAN TTC",2,{"v":2.5,"d":"$ 2.50"},{"$f":"Tabla1425[[#This Row],[CANT.]]*Tabla1425[[#This Row],[PRECIO UNITARIO]]","v":{"v":5,"d":"$5.00"}},0,{"v":5,"d":"$ 5.00"},{"$f":"Tabla1425[[#This Row],[EFECTIVO]]+Tabla1425[[#This Row],[TRANSFERENCIA]]","v":{"v":5,"d":"$ 5.00"}},"CANCELADO",{"$f":"Tabla1425[[#This Row],[VALOR A PAGAR]]-Tabla1425[[#This Row],[VALOR CANCELADO]]","v":0}]
["2025-05-12","ECUADOR",20,{"v":2.5,"d":"$ 2.50"},{"$f":"Tabla1425[[#This Row],[CANT.]]*Tabla1425[[#This Row],[PRECIO UNITARIO]]","v":{"v":50,"d":"$50.00"}},0,{"v":50,"d":"$ 50.00"},{"$f":"Tabla1425[[#This Row],[EFECTIVO]]+Tabla1425[[#This Row],[TRANSFERENCIA]]","v":{"v":50,"d":"$ 50.00"}},"CANCELADO",{"$f":"Tabla1425[[#This Row],[VALOR A PAGAR]]-Tabla1425[[#This Row],[VALOR CANCELADO]]","v":0},"CANCELA CON 2 GAL'S DIGITALES"]
["2025-05-12","KYORUGUI GYM",8,{"v":2.5,"d":"$ 2.50"},{"$f":"Tabla1425[[#This Row],[CANT.]]*Tabla1425[[#This Row],[PRECIO UNITARIO]]","v":{"v":20,"d":"$20.00"}},0,{"v":20,"d":"$ 20.00"},{"$f":"Tabla1425[[#This Row],[EFECTIVO]]+Tabla1425[[#This Row],[TRANSFERENCIA]]","v":{"v":20,"d":"$ 20.00"}},"CANCELADO",{"$f":"Tabla1425[[#This Row],[VALOR A PAGAR]]-Tabla1425[[#This Row],[VALOR CANCELADO]]","v":0},"EN DOS PAGOS (26-06-2025)"]
["2025-05-15","PYONGYANG",12,{"v":2.5,"d":"$ 2.50"},{"$f":"Tabla1425[[#This Row],[CANT.]]*Tabla1425[[#This Row],[PRECIO UNITARIO]]","v":{"v":30,"d":"$30.00"}},0,{"v":30,"d":"$ 30.00"},{"$f":"Tabla1425[[#This Row],[EFECTIVO]]+Tabla1425[[#This Row],[TRANSFERENCIA]]","v":{"v":30,"d":"$ 30.00"}},"CANCELADO",{"$f":"Tabla1425[[#This Row],[VALOR A PAGAR]]-Tabla1425[[#This Row],[VALOR CANCELADO]]","v":0},"CANCELA CON 21 GAL'S IMPRESOS"]
["2025-05-27","BAEKJUL TEAM AYALAZ",24,{"v":2.5,"d":"$ 2.50"},{"$f":"Tabla1425[[#This Row],[CANT.]]*Tabla1425[[#This Row],[PRECIO UNITARIO]]","v":{"v":60,"d":"$60.00"}},0,{"v":60,"d":"$ 60.00"},{"$f":"Tabla1425[[#This Row],[EFECTIVO]]+Tabla1425[[#This Row],[TRANSFERENCIA]]","v":{"v":60,"d":"$ 60.00"}},"CANCELADO",{"$f":"Tabla1425[[#This Row],[VALOR A PAGAR]]-Tabla1425[[#This Row],[VALOR CANCELADO]]","v":0},"CANCELA CON 3 GAL'S IMPRESOS Y HACE USO DE $15 A FAVOR"]
["2025-05-27","MINOTAUROS",12,{"v":2.5,"d":"$ 2.50"},{"$f":"Tabla1425[[#This Row],[CANT.]]*Tabla1425[[#This Row],[PRECIO UNITARIO]]","v":{"v":30,"d":"$30.00"}},0,{"v":30,"d":"$ 30.00"},{"$f":"Tabla1425[[#This Row],[EFECTIVO]]+Tabla1425[[#This Row],[TRANSFERENCIA]]","v":{"v":30,"d":"$ 30.00"}},"CANCELADO",{"$f":"Tabla1425[[#This Row],[VALOR A PAGAR]]-Tabla1425[[#This Row],[VALOR CANCELADO]]","v":0},"CANCELA CON 2 GAL'S IMPRESOS "]
["2025-05-27","GOYANG - IDEUL",4,{"v":2.5,"d":"$ 2.50"},{"$f":"Tabla1425[[#This Row],[CANT.]]*Tabla1425[[#This Row],[PRECIO UNITARIO]]","v":{"v":10,"d":"$10.00"}},0,{"v":10,"d":"$ 10.00"},{"$f":"Tabla1425[[#This Row],[EFECTIVO]]+Tabla1425[[#This Row],[TRANSFERENCIA]]","v":{"v":10,"d":"$ 10.00"}},"CANCELADO",{"$f":"Tabla1425[[#This Row],[VALOR A PAGAR]]-Tabla1425[[#This Row],[VALOR CANCELADO]]","v":0}]
["2025-06-05","JOSEON LEGACY",64,{"v":2.5,"d":"$ 2.50"},{"$f":"Tabla1425[[#This Row],[CANT.]]*Tabla1425[[#This Row],[PRECIO UNITARIO]]","v":{"v":160,"d":"$160.00"}},{"v":0.5,"d":"$ 0.50"},{"v":159.5,"d":"$ 159.50"},{"$f":"Tabla1425[[#This Row],[EFECTIVO]]+Tabla1425[[#This Row],[TRANSFERENCIA]]","v":{"v":160,"d":"$ 160.00"}},"CANCELADO",{"$f":"Tabla1425[[#This Row],[VALOR A PAGAR]]-Tabla1425[[#This Row],[VALOR CANCELADO]]","v":0},"CANCELA CON 29 GAL'S IMPRESOS Y 2 GAL'S DIGITALES"]
["2025-06-06","BAEKJUL TEAM FERNÁNDEZ",3,{"v":2.5,"d":"$ 2.50"},{"$f":"Tabla1425[[#This Row],[CANT.]]*Tabla1425[[#This Row],[PRECIO UNITARIO]]","v":{"v":7.5,"d":"$7.50"}},0,{"v":7.5,"d":"$ 7.50"},{"$f":"Tabla1425[[#This Row],[EFECTIVO]]+Tabla1425[[#This Row],[TRANSFERENCIA]]","v":{"v":7.5,"d":"$ 7.50"}},"CANCELADO",{"$f":"Tabla1425[[#This Row],[VALOR A PAGAR]]-Tabla1425[[#This Row],[VALOR CANCELADO]]","v":0}]
["2025-06-09","CAMU",12,{"v":2.5,"d":"$ 2.50"},{"$f":"Tabla1425[[#This Row],[CANT.]]*Tabla1425[[#This Row],[PRECIO UNITARIO]]","v":{"v":30,"d":"$30.00"}},0,{"v":30,"d":"$ 30.00"},{"$f":"Tabla1425[[#This Row],[EFECTIVO]]+Tabla1425[[#This Row],[TRANSFERENCIA]]","v":{"v":30,"d":"$ 30.00"}},"CANCELADO",{"$f":"Tabla1425[[#This Row],[VALOR A PAGAR]]-Tabla1425[[#This Row],[VALOR CANCELADO]]","v":0},"CANCELA CON 12 GAL'S IMPRESOS"]
["2025-06-09","EQUILIBRIO",12,{"v":2.5,"d":"$ 2.50"},{"$f":"Tabla1425[[#This Row],[CANT.]]*Tabla1425[[#This Row],[PRECIO UNITARIO]]","v":{"v":30,"d":"$30.00"}},0,{"v":30,"d":"$ 30.00"},{"$f":"Tabla1425[[#This Row],[EFECTIVO]]+Tabla1425[[#This Row],[TRANSFERENCIA]]","v":{"v":30,"d":"$ 30.00"}},"CANCELADO",{"$f":"Tabla1425[[#This Row],[VALOR A PAGAR]]-Tabla1425[[#This Row],[VALOR CANCELADO]]","v":0}]
["2025-06-11","PALADINS MARCIAL CLUB",8,{"v":2.5,"d":"$ 2.50"},{"$f":"Tabla1425[[#This Row],[CANT.]]*Tabla1425[[#This Row],[PRECIO UNITARIO]]","v":{"v":20,"d":"$20.00"}},0,{"v":20,"d":"$ 20.00"},{"$f":"Tabla1425[[#This Row],[EFECTIVO]]+Tabla1425[[#This Row],[TRANSFERENCIA]]","v":{"v":20,"d":"$ 20.00"}},"CANCELADO",{"$f":"Tabla1425[[#This Row],[VALOR A PAGAR]]-Tabla1425[[#This Row],[VALOR CANCELADO]]","v":0},"CANCELA CON 8 GAL'S IMPRESOS "]
["2025-06-12","SEUL \"LA ESTANCILLA\"",13,{"v":2.5,"d":"$ 2.50"},{"$f":"Tabla1425[[#This Row],[CANT.]]*Tabla1425[[#This Row],[PRECIO UNITARIO]]","v":{"v":32.5,"d":"$32.50"}},0,{"v":32.5,"d":"$ 32.50"},{"$f":"Tabla1425[[#This Row],[EFECTIVO]]+Tabla1425[[#This Row],[TRANSFERENCIA]]","v":{"v":32.5,"d":"$ 32.50"}},"CANCELADO",{"$f":"Tabla1425[[#This Row],[VALOR A PAGAR]]-Tabla1425[[#This Row],[VALOR CANCELADO]]","v":0}]
["2025-06-16","TOTAL KOMBAT",24,{"v":2.5,"d":"$ 2.50"},{"$f":"Tabla1425[[#This Row],[CANT.]]*Tabla1425[[#This Row],[PRECIO UNITARIO]]","v":{"v":60,"d":"$60.00"}},0,{"v":60,"d":"$ 60.00"},{"$f":"Tabla1425[[#This Row],[EFECTIVO]]+Tabla1425[[#This Row],[TRANSFERENCIA]]","v":{"v":60,"d":"$ 60.00"}},"CANCELADO",{"$f":"Tabla1425[[#This Row],[VALOR A PAGAR]]-Tabla1425[[#This Row],[VALOR CANCELADO]]","v":0}]
["2025-06-16","TOTAL KOMBAT RHINOS",30,{"v":2.5,"d":"$ 2.50"},{"$f":"Tabla1425[[#This Row],[CANT.]]*Tabla1425[[#This Row],[PRECIO UNITARIO]]","v":{"v":75,"d":"$75.00"}},0,{"v":75,"d":"$ 75.00"},{"$f":"Tabla1425[[#This Row],[EFECTIVO]]+Tabla1425[[#This Row],[TRANSFERENCIA]]","v":{"v":75,"d":"$ 75.00"}},"CANCELADO",{"$f":"Tabla1425[[#This Row],[VALOR A PAGAR]]-Tabla1425[[#This Row],[VALOR CANCELADO]]","v":0}]
["2025-06-16","TOTAL KOMBAT KOBRA KAY",11,{"v":2.5,"d":"$ 2.50"},{"$f":"Tabla1425[[#This Row],[CANT.]]*Tabla1425[[#This Row],[PRECIO UNITARIO]]","v":{"v":27.5,"d":"$27.50"}},0,{"v":27.5,"d":"$ 27.50"},{"$f":"Tabla1425[[#This Row],[EFECTIVO]]+Tabla1425[[#This Row],[TRANSFERENCIA]]","v":{"v":27.5,"d":"$ 27.50"}},"CANCELADO",{"$f":"Tabla1425[[#This Row],[VALOR A PAGAR]]-Tabla1425[[#This Row],[VALOR CANCELADO]]","v":0}]
["2025-06-19","TOTAL KOMBAT KUKKIWON C.C.",7,{"v":2.5,"d":"$ 2.50"},{"$f":"Tabla1425[[#This Row],[CANT.]]*Tabla1425[[#This Row],[PRECIO UNITARIO]]","v":{"v":17.5,"d":"$17.50"}},0,{"v":17.5,"d":"$ 17.50"},{"$f":"Tabla1425[[#This Row],[EFECTIVO]]+Tabla1425[[#This Row],[TRANSFERENCIA]]","v":{"v":17.5,"d":"$ 17.50"}},"CANCELADO",{"$f":"Tabla1425[[#This Row],[VALOR A PAGAR]]-Tabla1425[[#This Row],[VALOR CANCELADO]]","v":0}]
["2025-06-19","MIT-TKD",20,{"v":2.5,"d":"$ 2.50"},{"$f":"Tabla1425[[#This Row],[CANT.]]*Tabla1425[[#This Row],[PRECIO UNITARIO]]","v":{"v":50,"d":"$50.00"}},0,{"v":50,"d":"$ 50.00"},{"$f":"Tabla1425[[#This Row],[EFECTIVO]]+Tabla1425[[#This Row],[TRANSFERENCIA]]","v":{"v":50,"d":"$ 50.00"}},"CANCELADO",{"$f":"Tabla1425[[#This Row],[VALOR A PAGAR]]-Tabla1425[[#This Row],[VALOR CANCELADO]]","v":0}]
["2025-06-19","SIMJANG",25,{"v":2.5,"d":"$ 2.50"},{"$f":"Tabla1425[[#This Row],[CANT.]]*Tabla1425[[#This Row],[PRECIO UNITARIO]]","v":{"v":62.5,"d":"$62.50"}},0,{"v":62.5,"d":"$ 62.50"},{"$f":"Tabla1425[[#This Row],[EFECTIVO]]+Tabla1425[[#This Row],[TRANSFERENCIA]]","v":{"v":62.5,"d":"$ 62.50"}},"CANCELADO",{"$f":"Tabla1425[[#This Row],[VALOR A PAGAR]]-Tabla1425[[#This Row],[VALOR CANCELADO]]","v":0},"CANCELA CON 2 GAL'S DIGITALES"]
["2025-06-19","CHEN HUU",8,{"v":2.5,"d":"$ 2.50"},{"$f":"Tabla1425[[#This Row],[CANT.]]*Tabla1425[[#This Row],[PRECIO UNITARIO]]","v":{"v":20,"d":"$20.00"}},0,{"v":20,"d":"$ 20.00"},{"$f":"Tabla1425[[#This Row],[EFECTIVO]]+Tabla1425[[#This Row],[TRANSFERENCIA]]","v":{"v":20,"d":"$ 20.00"}},"CANCELADO",{"$f":"Tabla1425[[#This Row],[VALOR A PAGAR]]-Tabla1425[[#This Row],[VALOR CANCELADO]]","v":0},"CANCELA CON 33 GAL'S DIGITALES"]
["2025-06-19","TAE SHO KU",50,{"v":2.5,"d":"$ 2.50"},{"$f":"Tabla1425[[#This Row],[CANT.]]*Tabla1425[[#This Row],[PRECIO UNITARIO]]","v":{"v":125,"d":"$125.00"}},0,{"v":125,"d":"$ 125.00"},{"$f":"Tabla1425[[#This Row],[EFECTIVO]]+Tabla1425[[#This Row],[TRANSFERENCIA]]","v":{"v":125,"d":"$ 125.00"}},"CANCELADO",{"$f":"Tabla1425[[#This Row],[VALOR A PAGAR]]-Tabla1425[[#This Row],[VALOR CANCELADO]]","v":0},"CANCELA CON 8 GAL'S IMPRESOS "]
["2025-06-20","ECUADOR",33,{"v":2.5,"d":"$ 2.50"},{"$f":"Tabla1425[[#This Row],[CANT.]]*Tabla1425[[#This Row],[PRECIO UNITARIO]]","v":{"v":82.5,"d":"$82.50"}},0,{"v":82.5,"d":"$ 82.50"},{"$f":"Tabla1425[[#This Row],[EFECTIVO]]+Tabla1425[[#This Row],[TRANSFERENCIA]]","v":{"v":82.5,"d":"$ 82.50"}},"CANCELADO",{"$f":"Tabla1425[[#This Row],[VALOR A PAGAR]]-Tabla1425[[#This Row],[VALOR CANCELADO]]","v":0}]
["2025-06-23","BLUE DRAGONS",22,{"v":2.5,"d":"$ 2.50"},{"$f":"Tabla1425[[#This Row],[CANT.]]*Tabla1425[[#This Row],[PRECIO UNITARIO]]","v":{"v":55,"d":"$55.00"}},0,{"v":55,"d":"$ 55.00"},{"$f":"Tabla1425[[#This Row],[EFECTIVO]]+Tabla1425[[#This Row],[TRANSFERENCIA]]","v":{"v":55,"d":"$ 55.00"}},"CANCELADO",{"$f":"Tabla1425[[#This Row],[VALOR A PAGAR]]-Tabla1425[[#This Row],[VALOR CANCELADO]]","v":0},"CANCELA EN DOS PAGOS"]
["2025-06-24","SEUL AMÉRICA",1,{"v":2.5,"d":"$ 2.50"},{"$f":"Tabla1425[[#This Row],[CANT.]]*Tabla1425[[#This Row],[PRECIO UNITARIO]]","v":{"v":2.5,"d":"$2.50"}},null,{"v":2.5,"d":"$ 2.50"},{"$f":"Tabla1425[[#This Row],[EFECTIVO]]+Tabla1425[[#This Row],[TRANSFERENCIA]]","v":{"v":2.5,"d":"$ 2.50"}},"CANCELADO",{"$f":"Tabla1425[[#This Row],[VALOR A PAGAR]]-Tabla1425[[#This Row],[VALOR CANCELADO]]","v":0}]
["2025-06-24","SEUL CHUNG UI",27,{"v":2.5,"d":"$ 2.50"},{"$f":"Tabla1425[[#This Row],[CANT.]]*Tabla1425[[#This Row],[PRECIO UNITARIO]]","v":{"v":67.5,"d":"$67.50"}},null,{"v":67.5,"d":"$ 67.50"},{"$f":"Tabla1425[[#This Row],[EFECTIVO]]+Tabla1425[[#This Row],[TRANSFERENCIA]]","v":{"v":67.5,"d":"$ 67.50"}},"CANCELADO",{"$f":"Tabla1425[[#This Row],[VALOR A PAGAR]]-Tabla1425[[#This Row],[VALOR CANCELADO]]","v":0}]
["2025-06-24","SEUL CAPELO",9,{"v":2.5,"d":"$ 2.50"},{"$f":"Tabla1425[[#This Row],[CANT.]]*Tabla1425[[#This Row],[PRECIO UNITARIO]]","v":{"v":22.5,"d":"$22.50"}},null,{"v":22.5,"d":"$ 22.50"},{"$f":"Tabla1425[[#This Row],[EFECTIVO]]+Tabla1425[[#This Row],[TRANSFERENCIA]]","v":{"v":22.5,"d":"$ 22.50"}},"CANCELADO",{"$f":"Tabla1425[[#This Row],[VALOR A PAGAR]]-Tabla1425[[#This Row],[VALOR CANCELADO]]","v":0}]
["2025-06-25","SEUL CARAPUNGO",20,{"v":2.5,"d":"$ 2.50"},{"$f":"Tabla1425[[#This Row],[CANT.]]*Tabla1425[[#This Row],[PRECIO UNITARIO]]","v":{"v":50,"d":"$50.00"}},0,{"v":50,"d":"$ 50.00"},{"$f":"Tabla1425[[#This Row],[EFECTIVO]]+Tabla1425[[#This Row],[TRANSFERENCIA]]","v":{"v":50,"d":"$ 50.00"}},"CANCELADO",{"$f":"Tabla1425[[#This Row],[VALOR A PAGAR]]-Tabla1425[[#This Row],[VALOR CANCELADO]]","v":0}]
["2025-06-25","PIONERO FORTIS",33,{"v":2.5,"d":"$ 2.50"},{"$f":"Tabla1425[[#This Row],[CANT.]]*Tabla1425[[#This Row],[PRECIO UNITARIO]]","v":{"v":82.5,"d":"$82.50"}},0,{"v":82.5,"d":"$ 82.50"},{"$f":"Tabla1425[[#This Row],[EFECTIVO]]+Tabla1425[[#This Row],[TRANSFERENCIA]]","v":{"v":82.5,"d":"$ 82.50"}},"CANCELADO",{"$f":"Tabla1425[[#This Row],[VALOR A PAGAR]]-Tabla1425[[#This Row],[VALOR CANCELADO]]","v":0}]
["2025-06-26","ASOTKD - P (VICENTINA)",27,{"v":2.5,"d":"$ 2.50"},{"$f":"Tabla1425[[#This Row],[CANT.]]*Tabla1425[[#This Row],[PRECIO UNITARIO]]","v":{"v":67.5,"d":"$67.50"}},0,{"v":67.5,"d":"$ 67.50"},{"$f":"Tabla1425[[#This Row],[EFECTIVO]]+Tabla1425[[#This Row],[TRANSFERENCIA]]","v":{"v":67.5,"d":"$ 67.50"}},{"$f":"IF((E68=H68),\"CANCELADO\",\"SALDO PENDIENTE\")","v":"CANCELADO"},{"$f":"Tabla1425[[#This Row],[VALOR A PAGAR]]-Tabla1425[[#This Row],[VALOR CANCELADO]]","v":0}]
["2025-06-26","KYORUGUI GYM",6,{"v":2.5,"d":"$ 2.50"},{"$f":"Tabla1425[[#This Row],[CANT.]]*Tabla1425[[#This Row],[PRECIO UNITARIO]]","v":{"v":15,"d":"$15.00"}},0,{"v":15,"d":"$ 15.00"},{"$f":"Tabla1425[[#This Row],[EFECTIVO]]+Tabla1425[[#This Row],[TRANSFERENCIA]]","v":{"v":15,"d":"$ 15.00"}},"CANCELADO",{"$f":"Tabla1425[[#This Row],[VALOR A PAGAR]]-Tabla1425[[#This Row],[VALOR CANCELADO]]","v":0},"CANCELA CON 5 GAL'S DIGITALES"]
["2025-06-26","SHOGUN",23,{"v":2.5,"d":"$ 2.50"},{"$f":"Tabla1425[[#This Row],[CANT.]]*Tabla1425[[#This Row],[PRECIO UNITARIO]]","v":{"v":57.5,"d":"$57.50"}},0,{"v":57.5,"d":"$ 57.50"},{"$f":"Tabla1425[[#This Row],[EFECTIVO]]+Tabla1425[[#This Row],[TRANSFERENCIA]]","v":{"v":57.5,"d":"$ 57.50"}},"CANCELADO",{"$f":"Tabla1425[[#This Row],[VALOR A PAGAR]]-Tabla1425[[#This Row],[VALOR CANCELADO]]","v":0},"CANCELA EN DOS PAGOS"]
["2025-06-27","DEBAK TKD",76,{"v":2.5,"d":"$ 2.50"},{"$f":"Tabla1425[[#This Row],[CANT.]]*Tabla1425[[#This Row],[PRECIO UNITARIO]]","v":{"v":190,"d":"$190.00"}},0,{"v":190,"d":"$ 190.00"},{"$f":"Tabla1425[[#This Row],[EFECTIVO]]+Tabla1425[[#This Row],[TRANSFERENCIA]]","v":{"v":190,"d":"$ 190.00"}},"CANCELADO",{"$f":"Tabla1425[[#This Row],[VALOR A PAGAR]]-Tabla1425[[#This Row],[VALOR CANCELADO]]","v":0},"CANCELA EN DOS PAGOS"]
["2025-06-27","LEÓN",1,{"v":2.5,"d":"$ 2.50"},{"$f":"Tabla1425[[#This Row],[CANT.]]*Tabla1425[[#This Row],[PRECIO UNITARIO]]","v":{"v":2.5,"d":"$2.50"}},0,{"v":2.5,"d":"$ 2.50"},{"$f":"Tabla1425[[#This Row],[EFECTIVO]]+Tabla1425[[#This Row],[TRANSFERENCIA]]","v":{"v":2.5,"d":"$ 2.50"}},"CANCELADO",{"$f":"Tabla1425[[#This Row],[VALOR A PAGAR]]-Tabla1425[[#This Row],[VALOR CANCELADO]]","v":0},"CANCELA CON 1 GAL IMPRESO CANCELA $0,5 EN TRÁMITE DE 03-07-2025"]
["2025-07-01","DRAGON LEE GYM",4,{"v":2.5,"d":"$ 2.50"},{"$f":"Tabla1425[[#This Row],[CANT.]]*Tabla1425[[#This Row],[PRECIO UNITARIO]]","v":{"v":10,"d":"$10.00"}},0,{"v":10,"d":"$ 10.00"},{"$f":"Tabla1425[[#This Row],[EFECTIVO]]+Tabla1425[[#This Row],[TRANSFERENCIA]]","v":{"v":10,"d":"$ 10.00"}},"CANCELADO",{"$f":"Tabla1425[[#This Row],[VALOR A PAGAR]]-Tabla1425[[#This Row],[VALOR CANCELADO]]","v":0},"CANCELA CON 1 GAL DIGITAL",{"v":13.5,"d":"$13.50"},"A FAVOR"]
["2025-07-02","TAE SHO KU",2,{"v":2.5,"d":"$ 2.50"},{"$f":"Tabla1425[[#This Row],[CANT.]]*Tabla1425[[#This Row],[PRECIO UNITARIO]]","v":{"v":5,"d":"$5.00"}},0,{"v":5,"d":"$ 5.00"},{"$f":"Tabla1425[[#This Row],[EFECTIVO]]+Tabla1425[[#This Row],[TRANSFERENCIA]]","v":{"v":5,"d":"$ 5.00"}},"CANCELADO",{"$f":"Tabla1425[[#This Row],[VALOR A PAGAR]]-Tabla1425[[#This Row],[VALOR CANCELADO]]","v":0},"CANCELA CON 2 GAL'S DIGITALES"]
["2025-07-02","BAEKJUL TEAM FERNÁNDEZ",6,{"v":2.5,"d":"$ 2.50"},{"$f":"Tabla1425[[#This Row],[CANT.]]*Tabla1425[[#This Row],[PRECIO UNITARIO]]","v":{"v":15,"d":"$15.00"}},0,{"v":15,"d":"$ 15.00"},{"$f":"Tabla1425[[#This Row],[EFECTIVO]]+Tabla1425[[#This Row],[TRANSFERENCIA]]","v":{"v":15,"d":"$ 15.00"}},"CANCELADO",{"$f":"Tabla1425[[#This Row],[VALOR A PAGAR]]-Tabla1425[[#This Row],[VALOR CANCELADO]]","v":0}]
["2025-07-02","SEUL",71,{"v":2.5,"d":"$ 2.50"},{"$f":"Tabla1425[[#This Row],[CANT.]]*Tabla1425[[#This Row],[PRECIO UNITARIO]]","v":{"v":177.5,"d":"$177.50"}},0,{"v":177.5,"d":"$ 177.50"},{"$f":"Tabla1425[[#This Row],[EFECTIVO]]+Tabla1425[[#This Row],[TRANSFERENCIA]]","v":{"v":177.5,"d":"$ 177.50"}},"CANCELADO",{"$f":"Tabla1425[[#This Row],[VALOR A PAGAR]]-Tabla1425[[#This Row],[VALOR CANCELADO]]","v":0}]
["2025-07-03","FIRST CLASS",7,{"v":2.5,"d":"$ 2.50"},{"$f":"Tabla1425[[#This Row],[CANT.]]*Tabla1425[[#This Row],[PRECIO UNITARIO]]","v":{"v":17.5,"d":"$17.50"}},0,{"v":17.5,"d":"$ 17.50"},{"$f":"Tabla1425[[#This Row],[EFECTIVO]]+Tabla1425[[#This Row],[TRANSFERENCIA]]","v":{"v":17.5,"d":"$ 17.50"}},"CANCELADO",{"$f":"Tabla1425[[#This Row],[VALOR A PAGAR]]-Tabla1425[[#This Row],[VALOR CANCELADO]]","v":0},"CANCELA EN DOS PAGOS"]
["2025-07-07","KO AMÉRICA DRAGON FIRE",1,{"v":2.5,"d":"$ 2.50"},{"$f":"Tabla1425[[#This Row],[CANT.]]*Tabla1425[[#This Row],[PRECIO UNITARIO]]","v":{"v":2.5,"d":"$2.50"}},0,{"v":2.5,"d":"$ 2.50"},{"$f":"Tabla1425[[#This Row],[EFECTIVO]]+Tabla1425[[#This Row],[TRANSFERENCIA]]","v":{"v":2.5,"d":"$ 2.50"}},"CANCELADO",{"$f":"Tabla1425[[#This Row],[VALOR A PAGAR]]-Tabla1425[[#This Row],[VALOR CANCELADO]]","v":0}]
["2025-07-07","MSA GRAND MASTER",19,{"v":2.5,"d":"$ 2.50"},{"$f":"Tabla1425[[#This Row],[CANT.]]*Tabla1425[[#This Row],[PRECIO UNITARIO]]","v":{"v":47.5,"d":"$47.50"}},0,{"v":47.5,"d":"$ 47.50"},{"$f":"Tabla1425[[#This Row],[EFECTIVO]]+Tabla1425[[#This Row],[TRANSFERENCIA]]","v":{"v":47.5,"d":"$ 47.50"}},"CANCELADO",{"$f":"Tabla1425[[#This Row],[VALOR A PAGAR]]-Tabla1425[[#This Row],[VALOR CANCELADO]]","v":0},"CANCELA CON 6 GAL'S DIGITALES"]
["2025-07-07","ASOTKD - P CHIMBACALLE",35,{"v":2.5,"d":"$ 2.50"},{"$f":"Tabla1425[[#This Row],[CANT.]]*Tabla1425[[#This Row],[PRECIO UNITARIO]]","v":{"v":87.5,"d":"$87.50"}},{"v":87.5,"d":"$ 87.50"},0,{"$f":"Tabla1425[[#This Row],[EFECTIVO]]+Tabla1425[[#This Row],[TRANSFERENCIA]]","v":{"v":87.5,"d":"$ 87.50"}},"CANCELADO",{"$f":"Tabla1425[[#This Row],[VALOR A PAGAR]]-Tabla1425[[#This Row],[VALOR CANCELADO]]","v":0},"CANCELA CON 1 GAL IMPRESO"]
["2025-07-07","CHUNG SONG",36,{"v":2.5,"d":"$ 2.50"},{"$f":"Tabla1425[[#This Row],[CANT.]]*Tabla1425[[#This Row],[PRECIO UNITARIO]]","v":{"v":90,"d":"$90.00"}},0,{"v":90,"d":"$ 90.00"},{"$f":"Tabla1425[[#This Row],[EFECTIVO]]+Tabla1425[[#This Row],[TRANSFERENCIA]]","v":{"v":90,"d":"$ 90.00"}},"CANCELADO",{"$f":"Tabla1425[[#This Row],[VALOR A PAGAR]]-Tabla1425[[#This Row],[VALOR CANCELADO]]","v":0},"CANCELA EN DOS PAGOS"]
["2025-07-07","TAE WOONG",17,{"v":2.5,"d":"$ 2.50"},{"$f":"Tabla1425[[#This Row],[CANT.]]*Tabla1425[[#This Row],[PRECIO UNITARIO]]","v":{"v":42.5,"d":"$42.50"}},0,{"v":42.5,"d":"$ 42.50"},{"$f":"Tabla1425[[#This Row],[EFECTIVO]]+Tabla1425[[#This Row],[TRANSFERENCIA]]","v":{"v":42.5,"d":"$ 42.50"}},"CANCELADO",{"$f":"Tabla1425[[#This Row],[VALOR A PAGAR]]-Tabla1425[[#This Row],[VALOR CANCELADO]]","v":0}]
["2025-07-09","CHEN HUU",1,{"v":2.5,"d":"$ 2.50"},{"$f":"Tabla1425[[#This Row],[CANT.]]*Tabla1425[[#This Row],[PRECIO UNITARIO]]","v":{"v":2.5,"d":"$2.50"}},0,{"v":2.5,"d":"$ 2.50"},{"$f":"Tabla1425[[#This Row],[EFECTIVO]]+Tabla1425[[#This Row],[TRANSFERENCIA]]","v":{"v":2.5,"d":"$ 2.50"}},"CANCELADO",{"$f":"Tabla1425[[#This Row],[VALOR A PAGAR]]-Tabla1425[[#This Row],[VALOR CANCELADO]]","v":0},"CANCELA CON REIMPRESIÓN DE 3 GAL'S"]
["2025-07-10","SOCIEDAD DEPORTIVA CENTRAL",1,{"v":2.5,"d":"$ 2.50"},{"$f":"Tabla1425[[#This Row],[CANT.]]*Tabla1425[[#This Row],[PRECIO UNITARIO]]","v":{"v":2.5,"d":"$2.50"}},{"v":2.5,"d":"$ 2.50"},0,{"$f":"Tabla1425[[#This Row],[EFECTIVO]]+Tabla1425[[#This Row],[TRANSFERENCIA]]","v":{"v":2.5,"d":"$ 2.50"}},"CANCELADO",{"$f":"Tabla1425[[#This Row],[VALOR A PAGAR]]-Tabla1425[[#This Row],[VALOR CANCELADO]]","v":0},"CERTIFICADO Y GAL DEL 27-04-2024"]
["2025-07-11","BORJA'S LIONS",21,{"v":2.5,"d":"$ 2.50"},{"$f":"Tabla1425[[#This Row],[CANT.]]*Tabla1425[[#This Row],[PRECIO UNITARIO]]","v":{"v":52.5,"d":"$52.50"}},0,{"v":52.5,"d":"$ 52.50"},{"$f":"Tabla1425[[#This Row],[EFECTIVO]]+Tabla1425[[#This Row],[TRANSFERENCIA]]","v":{"v":52.5,"d":"$ 52.50"}},"CANCELADO",{"$f":"Tabla1425[[#This Row],[VALOR A PAGAR]]-Tabla1425[[#This Row],[VALOR CANCELADO]]","v":0},"CANCELA CON 4 GAL'S IMPRESOS"]
["2025-07-17","FARANG",8,{"v":2.5,"d":"$ 2.50"},{"$f":"Tabla1425[[#This Row],[CANT.]]*Tabla1425[[#This Row],[PRECIO UNITARIO]]","v":{"v":20,"d":"$20.00"}},0,{"v":20,"d":"$ 20.00"},{"$f":"Tabla1425[[#This Row],[EFECTIVO]]+Tabla1425[[#This Row],[TRANSFERENCIA]]","v":{"v":20,"d":"$ 20.00"}},"CANCELADO",{"$f":"Tabla1425[[#This Row],[VALOR A PAGAR]]-Tabla1425[[#This Row],[VALOR CANCELADO]]","v":0},"CANCELA CON 41GAL IMPRESO"]
["2025-07-22","KO AMÉRICA",51,{"v":2.5,"d":"$ 2.50"},{"$f":"Tabla1425[[#This Row],[CANT.]]*Tabla1425[[#This Row],[PRECIO UNITARIO]]","v":{"v":127.5,"d":"$127.50"}},0,{"v":127.5,"d":"$ 127.50"},{"$f":"Tabla1425[[#This Row],[EFECTIVO]]+Tabla1425[[#This Row],[TRANSFERENCIA]]","v":{"v":127.5,"d":"$ 127.50"}},"CANCELADO",{"$f":"Tabla1425[[#This Row],[VALOR A PAGAR]]-Tabla1425[[#This Row],[VALOR CANCELADO]]","v":0},"EN DOS PAGOS"]
["2025-07-24","TAEGUK JUCARO",5,{"v":2.5,"d":"$ 2.50"},{"$f":"Tabla1425[[#This Row],[CANT.]]*Tabla1425[[#This Row],[PRECIO UNITARIO]]","v":{"v":12.5,"d":"$12.50"}},0,{"v":12.5,"d":"$ 12.50"},{"$f":"Tabla1425[[#This Row],[EFECTIVO]]+Tabla1425[[#This Row],[TRANSFERENCIA]]","v":{"v":12.5,"d":"$ 12.50"}},"CANCELADO",{"$f":"Tabla1425[[#This Row],[VALOR A PAGAR]]-Tabla1425[[#This Row],[VALOR CANCELADO]]","v":0}]
["2025-07-28","KO AMÉRICA",12,{"v":2.5,"d":"$ 2.50"},{"$f":"Tabla1425[[#This Row],[CANT.]]*Tabla1425[[#This Row],[PRECIO UNITARIO]]","v":{"v":30,"d":"$30.00"}},0,{"v":30,"d":"$ 30.00"},{"$f":"Tabla1425[[#This Row],[EFECTIVO]]+Tabla1425[[#This Row],[TRANSFERENCIA]]","v":{"v":30,"d":"$ 30.00"}},"CANCELADO",{"$f":"Tabla1425[[#This Row],[VALOR A PAGAR]]-Tabla1425[[#This Row],[VALOR CANCELADO]]","v":0},"EN DOS PAGOS"]
["2025-07-29","MARCIAL CLUB GRANDA",11,{"v":2.5,"d":"$ 2.50"},{"$f":"Tabla1425[[#This Row],[CANT.]]*Tabla1425[[#This Row],[PRECIO UNITARIO]]","v":{"v":27.5,"d":"$27.50"}},0,{"v":27.5,"d":"$ 27.50"},{"$f":"Tabla1425[[#This Row],[EFECTIVO]]+Tabla1425[[#This Row],[TRANSFERENCIA]]","v":{"v":27.5,"d":"$ 27.50"}},"CANCELADO",{"$f":"Tabla1425[[#This Row],[VALOR A PAGAR]]-Tabla1425[[#This Row],[VALOR CANCELADO]]","v":0}]
["2025-07-30","HANSU",146,{"v":2.5,"d":"$ 2.50"},{"$f":"Tabla1425[[#This Row],[CANT.]]*Tabla1425[[#This Row],[PRECIO UNITARIO]]","v":{"v":365,"d":"$365.00"}},{"v":365,"d":"$ 365.00"},0,{"$f":"Tabla1425[[#This Row],[EFECTIVO]]+Tabla1425[[#This Row],[TRANSFERENCIA]]","v":{"v":365,"d":"$ 365.00"}},"CANCELADO",{"$f":"Tabla1425[[#This Row],[VALOR A PAGAR]]-Tabla1425[[#This Row],[VALOR CANCELADO]]","v":0}]
["2025-07-30","KUKKIWON",9,{"v":2.5,"d":"$ 2.50"},{"$f":"Tabla1425[[#This Row],[CANT.]]*Tabla1425[[#This Row],[PRECIO UNITARIO]]","v":{"v":22.5,"d":"$22.50"}},0,{"v":22.5,"d":"$ 22.50"},{"$f":"Tabla1425[[#This Row],[EFECTIVO]]+Tabla1425[[#This Row],[TRANSFERENCIA]]","v":{"v":22.5,"d":"$ 22.50"}},"CANCELADO",{"$f":"Tabla1425[[#This Row],[VALOR A PAGAR]]-Tabla1425[[#This Row],[VALOR CANCELADO]]","v":0},"CANCELA CON 1 GAL IMPRESO"]
["2025-07-31","BAS PANTHERS",22,{"v":2.5,"d":"$ 2.50"},{"$f":"Tabla1425[[#This Row],[CANT.]]*Tabla1425[[#This Row],[PRECIO UNITARIO]]","v":{"v":55,"d":"$55.00"}},0,{"v":55,"d":"$ 55.00"},{"$f":"Tabla1425[[#This Row],[EFECTIVO]]+Tabla1425[[#This Row],[TRANSFERENCIA]]","v":{"v":55,"d":"$ 55.00"}},"CANCELADO",{"$f":"Tabla1425[[#This Row],[VALOR A PAGAR]]-Tabla1425[[#This Row],[VALOR CANCELADO]]","v":0},"CANCELA CON 7 GAL'S IMPRESOS"]
["2025-08-06","MARCIAL CLUB GRANDA",1,{"v":2.5,"d":"$ 2.50"},{"$f":"Tabla1425[[#This Row],[CANT.]]*Tabla1425[[#This Row],[PRECIO UNITARIO]]","v":{"v":2.5,"d":"$2.50"}},0,{"v":2.5,"d":"$ 2.50"},{"$f":"Tabla1425[[#This Row],[EFECTIVO]]+Tabla1425[[#This Row],[TRANSFERENCIA]]","v":{"v":2.5,"d":"$ 2.50"}},"CANCELADO",{"$f":"Tabla1425[[#This Row],[VALOR A PAGAR]]-Tabla1425[[#This Row],[VALOR CANCELADO]]","v":0}]
["2025-08-07","KORYO",1,{"v":2.5,"d":"$ 2.50"},{"$f":"Tabla1425[[#This Row],[CANT.]]*Tabla1425[[#This Row],[PRECIO UNITARIO]]","v":{"v":2.5,"d":"$2.50"}},{"v":0.5,"d":"$ 0.50"},{"v":2,"d":"$ 2.00"},{"$f":"Tabla1425[[#This Row],[EFECTIVO]]+Tabla1425[[#This Row],[TRANSFERENCIA]]","v":{"v":2.5,"d":"$ 2.50"}},"CANCELADO",{"$f":"Tabla1425[[#This Row],[VALOR A PAGAR]]-Tabla1425[[#This Row],[VALOR CANCELADO]]","v":0},"CANCELA CON 1 GAL IMPRESO"]
["2025-08-07","YONG TIGER",1,{"v":2.5,"d":"$ 2.50"},{"$f":"Tabla1425[[#This Row],[CANT.]]*Tabla1425[[#This Row],[PRECIO UNITARIO]]","v":{"v":2.5,"d":"$2.50"}},0,{"v":2.5,"d":"$ 2.50"},{"$f":"Tabla1425[[#This Row],[EFECTIVO]]+Tabla1425[[#This Row],[TRANSFERENCIA]]","v":{"v":2.5,"d":"$ 2.50"}},"CANCELADO",{"$f":"Tabla1425[[#This Row],[VALOR A PAGAR]]-Tabla1425[[#This Row],[VALOR CANCELADO]]","v":0},"PAGO REALIZADO EL 03-07-2025"]
["2025-08-07","MICHAY DO",13,{"v":2.5,"d":"$ 2.50"},{"$f":"Tabla1425[[#This Row],[CANT.]]*Tabla1425[[#This Row],[PRECIO UNITARIO]]","v":{"v":32.5,"d":"$32.50"}},0,{"v":32.5,"d":"$ 32.50"},{"$f":"Tabla1425[[#This Row],[EFECTIVO]]+Tabla1425[[#This Row],[TRANSFERENCIA]]","v":{"v":32.5,"d":"$ 32.50"}},"CANCELADO",{"$f":"Tabla1425[[#This Row],[VALOR A PAGAR]]-Tabla1425[[#This Row],[VALOR CANCELADO]]","v":0},"EN DOS PAGOS"]
["2025-08-08","FIRST CLASS",1,{"v":2.5,"d":"$ 2.50"},{"$f":"Tabla1425[[#This Row],[CANT.]]*Tabla1425[[#This Row],[PRECIO UNITARIO]]","v":{"v":2.5,"d":"$2.50"}},0,{"v":2.5,"d":"$ 2.50"},{"$f":"Tabla1425[[#This Row],[EFECTIVO]]+Tabla1425[[#This Row],[TRANSFERENCIA]]","v":{"v":2.5,"d":"$ 2.50"}},"CANCELADO",{"$f":"Tabla1425[[#This Row],[VALOR A PAGAR]]-Tabla1425[[#This Row],[VALOR CANCELADO]]","v":0},"CANCELA CON 1 GAL IMPRESO"]
["2025-08-08","TAE KING'S",2,{"v":2.5,"d":"$ 2.50"},{"$f":"Tabla1425[[#This Row],[CANT.]]*Tabla1425[[#This Row],[PRECIO UNITARIO]]","v":{"v":5,"d":"$5.00"}},0,{"v":5,"d":"$ 5.00"},{"$f":"Tabla1425[[#This Row],[EFECTIVO]]+Tabla1425[[#This Row],[TRANSFERENCIA]]","v":{"v":5,"d":"$ 5.00"}},"CANCELADO",{"$f":"Tabla1425[[#This Row],[VALOR A PAGAR]]-Tabla1425[[#This Row],[VALOR CANCELADO]]","v":0},"CANCELA CON 2 GAL'S DIGITALES"]
["2025-08-12","BAS PANTHERS",1,{"v":2.5,"d":"$ 2.50"},{"$f":"Tabla1425[[#This Row],[CANT.]]*Tabla1425[[#This Row],[PRECIO UNITARIO]]","v":{"v":2.5,"d":"$2.50"}},0,{"v":2.5,"d":"$ 2.50"},{"$f":"Tabla1425[[#This Row],[EFECTIVO]]+Tabla1425[[#This Row],[TRANSFERENCIA]]","v":{"v":2.5,"d":"$ 2.50"}},{"$f":"IF((E100=H100),\"CANCELADO\",\"SALDO PENDIENTE\")","v":"CANCELADO"},{"$f":"Tabla1425[[#This Row],[VALOR A PAGAR]]-Tabla1425[[#This Row],[VALOR CANCELADO]]","v":0},"REIMPRESIÓN"]
["2025-08-15","PVM - ROJAS IAN IRON FIST",17,{"v":2.5,"d":"$ 2.50"},{"$f":"Tabla1425[[#This Row],[CANT.]]*Tabla1425[[#This Row],[PRECIO UNITARIO]]","v":{"v":42.5,"d":"$42.50"}},0,{"v":42.5,"d":"$ 42.50"},{"$f":"Tabla1425[[#This Row],[EFECTIVO]]+Tabla1425[[#This Row],[TRANSFERENCIA]]","v":{"v":42.5,"d":"$ 42.50"}},"CANCELADO",{"$f":"Tabla1425[[#This Row],[VALOR A PAGAR]]-Tabla1425[[#This Row],[VALOR CANCELADO]]","v":0}]
["2025-08-16","KYORUGUI GYM",12,{"v":2.5,"d":"$ 2.50"},{"$f":"Tabla1425[[#This Row],[CANT.]]*Tabla1425[[#This Row],[PRECIO UNITARIO]]","v":{"v":30,"d":"$30.00"}},0,{"v":30,"d":"$ 30.00"},{"$f":"Tabla1425[[#This Row],[EFECTIVO]]+Tabla1425[[#This Row],[TRANSFERENCIA]]","v":{"v":30,"d":"$ 30.00"}},"CANCELADO",{"$f":"Tabla1425[[#This Row],[VALOR A PAGAR]]-Tabla1425[[#This Row],[VALOR CANCELADO]]","v":0}]
["2025-08-18","HAN KUM DO",16,{"v":2.5,"d":"$ 2.50"},{"$f":"Tabla1425[[#This Row],[CANT.]]*Tabla1425[[#This Row],[PRECIO UNITARIO]]","v":{"v":40,"d":"$40.00"}},0,{"v":40,"d":"$ 40.00"},{"$f":"Tabla1425[[#This Row],[EFECTIVO]]+Tabla1425[[#This Row],[TRANSFERENCIA]]","v":{"v":40,"d":"$ 40.00"}},"CANCELADO",{"$f":"Tabla1425[[#This Row],[VALOR A PAGAR]]-Tabla1425[[#This Row],[VALOR CANCELADO]]","v":0}]
["2025-08-18","MIKIDO",14,{"v":2.5,"d":"$ 2.50"},{"$f":"Tabla1425[[#This Row],[CANT.]]*Tabla1425[[#This Row],[PRECIO UNITARIO]]","v":{"v":35,"d":"$35.00"}},0,{"v":35,"d":"$ 35.00"},{"$f":"Tabla1425[[#This Row],[EFECTIVO]]+Tabla1425[[#This Row],[TRANSFERENCIA]]","v":{"v":35,"d":"$ 35.00"}},"CANCELADO",{"$f":"Tabla1425[[#This Row],[VALOR A PAGAR]]-Tabla1425[[#This Row],[VALOR CANCELADO]]","v":0},"CANCELA CON 5 GAL'S IMPRESOS"]
["2025-08-18","ARES",33,{"v":2.5,"d":"$ 2.50"},{"$f":"Tabla1425[[#This Row],[CANT.]]*Tabla1425[[#This Row],[PRECIO UNITARIO]]","v":{"v":82.5,"d":"$82.50"}},0,{"v":82.5,"d":"$ 82.50"},{"$f":"Tabla1425[[#This Row],[EFECTIVO]]+Tabla1425[[#This Row],[TRANSFERENCIA]]","v":{"v":82.5,"d":"$ 82.50"}},"CANCELADO",{"$f":"Tabla1425[[#This Row],[VALOR A PAGAR]]-Tabla1425[[#This Row],[VALOR CANCELADO]]","v":0},"EN TRES PAGOS"]
["2025-08-19","DRACO",23,{"v":2.5,"d":"$ 2.50"},{"$f":"Tabla1425[[#This Row],[CANT.]]*Tabla1425[[#This Row],[PRECIO UNITARIO]]","v":{"v":57.5,"d":"$57.50"}},0,{"v":57.5,"d":"$ 57.50"},{"$f":"Tabla1425[[#This Row],[EFECTIVO]]+Tabla1425[[#This Row],[TRANSFERENCIA]]","v":{"v":57.5,"d":"$ 57.50"}},"CANCELADO",{"$f":"Tabla1425[[#This Row],[VALOR A PAGAR]]-Tabla1425[[#This Row],[VALOR CANCELADO]]","v":0}]
["2025-08-21","BORJA'S LIONS",4,{"v":2.5,"d":"$ 2.50"},{"$f":"Tabla1425[[#This Row],[CANT.]]*Tabla1425[[#This Row],[PRECIO UNITARIO]]","v":{"v":10,"d":"$10.00"}},0,{"v":10,"d":"$ 10.00"},{"$f":"Tabla1425[[#This Row],[EFECTIVO]]+Tabla1425[[#This Row],[TRANSFERENCIA]]","v":{"v":10,"d":"$ 10.00"}},"CANCELADO",{"$f":"Tabla1425[[#This Row],[VALOR A PAGAR]]-Tabla1425[[#This Row],[VALOR CANCELADO]]","v":0},"CANCELA CON 4 GAL'S IMPRESOS (HACE USO DE SALDO A FAVOR DE $2,50 DEL 11-07-2025)"]
["2025-08-22","BORJA'S LIONS",32,{"v":2.5,"d":"$ 2.50"},{"$f":"Tabla1425[[#This Row],[CANT.]]*Tabla1425[[#This Row],[PRECIO UNITARIO]]","v":{"v":80,"d":"$80.00"}},0,{"v":80,"d":"$ 80.00"},{"$f":"Tabla1425[[#This Row],[EFECTIVO]]+Tabla1425[[#This Row],[TRANSFERENCIA]]","v":{"v":80,"d":"$ 80.00"}},"CANCELADO",{"$f":"Tabla1425[[#This Row],[VALOR A PAGAR]]-Tabla1425[[#This Row],[VALOR CANCELADO]]","v":0}]
["2025-08-22","CIUDAD DE QUITO",2,{"v":2.5,"d":"$ 2.50"},{"$f":"Tabla1425[[#This Row],[CANT.]]*Tabla1425[[#This Row],[PRECIO UNITARIO]]","v":{"v":5,"d":"$5.00"}},0,{"v":5,"d":"$ 5.00"},{"$f":"Tabla1425[[#This Row],[EFECTIVO]]+Tabla1425[[#This Row],[TRANSFERENCIA]]","v":{"v":5,"d":"$ 5.00"}},"CANCELADO",{"$f":"Tabla1425[[#This Row],[VALOR A PAGAR]]-Tabla1425[[#This Row],[VALOR CANCELADO]]","v":0}]
["2025-08-25","BAEKJUL",40,{"v":2.5,"d":"$ 2.50"},{"$f":"Tabla1425[[#This Row],[CANT.]]*Tabla1425[[#This Row],[PRECIO UNITARIO]]","v":{"v":100,"d":"$100.00"}},0,{"v":100,"d":"$ 100.00"},{"$f":"Tabla1425[[#This Row],[EFECTIVO]]+Tabla1425[[#This Row],[TRANSFERENCIA]]","v":{"v":100,"d":"$ 100.00"}},"CANCELADO",{"$f":"Tabla1425[[#This Row],[VALOR A PAGAR]]-Tabla1425[[#This Row],[VALOR CANCELADO]]","v":0},"CANCELA CON 4 GAL'S IMPRESOS"]
["2025-08-26","ARES",1,{"v":2.5,"d":"$ 2.50"},{"$f":"Tabla1425[[#This Row],[CANT.]]*Tabla1425[[#This Row],[PRECIO UNITARIO]]","v":{"v":2.5,"d":"$2.50"}},0,{"v":2.5,"d":"$ 2.50"},{"$f":"Tabla1425[[#This Row],[EFECTIVO]]+Tabla1425[[#This Row],[TRANSFERENCIA]]","v":{"v":2.5,"d":"$ 2.50"}},"CANCELADO",{"$f":"Tabla1425[[#This Row],[VALOR A PAGAR]]-Tabla1425[[#This Row],[VALOR CANCELADO]]","v":0},"REIMPRESIÓN DE DIPLOMA 6548 Y HACE USO DE SALDO A FAVOR (18-08-2025)"]
["2025-08-28","KYORUGUI GYM",2,{"v":2.5,"d":"$ 2.50"},{"$f":"Tabla1425[[#This Row],[CANT.]]*Tabla1425[[#This Row],[PRECIO UNITARIO]]","v":{"v":5,"d":"$5.00"}},0,{"v":5,"d":"$ 5.00"},{"$f":"Tabla1425[[#This Row],[EFECTIVO]]+Tabla1425[[#This Row],[TRANSFERENCIA]]","v":{"v":5,"d":"$ 5.00"}},"CANCELADO",{"$f":"Tabla1425[[#This Row],[VALOR A PAGAR]]-Tabla1425[[#This Row],[VALOR CANCELADO]]","v":0}]
["2025-09-01","MARCIAL CLUB GRANDA",1,{"v":2.5,"d":"$ 2.50"},{"$f":"Tabla1425[[#This Row],[CANT.]]*Tabla1425[[#This Row],[PRECIO UNITARIO]]","v":{"v":2.5,"d":"$2.50"}},0,{"v":2.5,"d":"$ 2.50"},{"$f":"Tabla1425[[#This Row],[EFECTIVO]]+Tabla1425[[#This Row],[TRANSFERENCIA]]","v":{"v":2.5,"d":"$ 2.50"}},"CANCELADO",{"$f":"Tabla1425[[#This Row],[VALOR A PAGAR]]-Tabla1425[[#This Row],[VALOR CANCELADO]]","v":0}]
["2025-09-05","LEÓN",15,{"v":2.5,"d":"$ 2.50"},{"$f":"Tabla1425[[#This Row],[CANT.]]*Tabla1425[[#This Row],[PRECIO UNITARIO]]","v":{"v":37.5,"d":"$37.50"}},0,{"v":37.5,"d":"$ 37.50"},{"$f":"Tabla1425[[#This Row],[EFECTIVO]]+Tabla1425[[#This Row],[TRANSFERENCIA]]","v":{"v":37.5,"d":"$ 37.50"}},"CANCELADO",{"$f":"Tabla1425[[#This Row],[VALOR A PAGAR]]-Tabla1425[[#This Row],[VALOR CANCELADO]]","v":0}]
["TOTAL",null,{"$f":"SUM(C4:C114)","v":1955},null,{"$f":"SUM(Tabla1425[VALOR A PAGAR])","v":{"v":4887.5,"d":"$4,887.50"}},{"$f":"SUM(F4:F114)","v":{"v":886,"d":"$886.00"}},{"$f":"SUM(G4:G114)","v":{"v":4001.5,"d":"$4,001.50"}},{"$f":"SUM(H4:H114)","v":{"v":4887.5,"d":"$4,887.50"}}]
[null,null,"DIPLOMAS ELABORADOS",null,"A RECAUDARSE","RECAUDADO EN EFECTIVO","RECAUDADO EN TRANSFERENCIA"]
[]
[]
[null,"RECAUDADO","MONTO"]
[null,"EFECTIVO",{"$f":"F115","v":{"v":886,"d":"$886.00"}}]
[null,"TRANSFERENCIA",{"$f":"G115","v":{"v":4001.5,"d":"$4,001.50"}}]
[null,"TOTAL",{"$f":"SUM(C120:C121)","v":{"v":4887.5,"d":"$4,887.50"}}]
[]
[]
[null,"POR COBRAR","MONTO"]
[null,"NINGUNO",{"v":0,"d":"$0.00"}]
[null,"TOTAL",{"$f":"SUM(C126:C126)","v":{"v":0,"d":"$0.00"}}]
[]
[]
[null,"DEVOLVER O HACER PASO","MONTO"]
[null,{"$f":"B32","v":"TAE DO ACADEMY"},{"v":2.5,"d":"$2.50"}]
[null,{"$f":"B73","v":"DRAGON LEE GYM"},{"v":13.5,"d":"$13.50"}]
[null,{"$f":"B96","v":"YONG TIGER"},{"v":1.5,"d":"$1.50"}]
[null,{"$f":"B105","v":"ARES"},{"v":14,"d":"$14.00"}]
[null,"TOTAL",{"$f":"SUM(C131:C134)","v":{"v":31.5,"d":"$31.50"}}]

{"sheet":"FESTIVAL Y SELECTIVO JUNIOR","index":5,"n_rows":69,"n_cols":8,"rows_kept":69,"merged":[[0,0,0,7],[1,0,1,7],[2,0,2,7],[3,0,3,7],[36,0,36,2],[39,1,39,2],[46,1,46,2]]}
["ASOCIACIÓN DE TAEKWONDO DE PICHINCHA"]
["FESTIVAL DE HABILIDADES MOTRICES Y SELECTIVO JUNIOR "]
["COLISEO \"LOS QUITUS\" (05 DE ABRIL DEL 2025)"]
[]
["Nº","CLUB","SIGLAS","FESTIVAL","SELECTIVO","PAGO EFECT.","PAGO TRANSF.","ESTADO DE PAGO"]
[1,"APOLO","APO",13,0,{"v":208,"d":"$208.00"},0,"PAGADO"]
[2,"ARES","ARE",9,0,{"v":74,"d":"$74.00"},{"v":70,"d":"$70.00"},"PAGADO"]
[3,"ASOCIACION DE TKDP","ASO",14,0,{"v":176,"d":"$176.00"},{"v":22,"d":"$22.00"},"PAGADO"]
[4,"BAEKJUL TAEKWONDO","BKJ",15,0,{"v":240,"d":"$240.00"},0,"PAGADO"]
[5,"BAEKJUL TEAM AYALAZ","BKJ",15,0,0,{"v":240,"d":"$240.00"},"PAGADO"]
[6,"BAS PANTHERS","BSP",10,0,{"v":160,"d":"$160.00"},0,"PAGADO"]
[7,"CHAMPIONS FOR LIFE","CFL",4,1,0,{"v":69,"d":"$69.00"},"PAGADO"]
[8,"CIUDAD DE QUITO","CDQ",2,2,{"v":5,"d":"$5.00"},{"v":32,"d":"$32.00"},"PAGADO"]
[9,"DEBAK TKD","DBK",10,1,{"v":140,"d":"$140.00"},{"v":25,"d":"$25.00"},"PAGADO"]
[10,"DRACO","DRA",8,0,0,{"v":128,"d":"$128.00"},"PAGADO"]
[11,"FARANG","FRG",1,0,0,{"v":16,"d":"$16.00"},"PAGADO"]
[12,"JOSEON LEGACY","JOL",7,0,0,{"v":112,"d":"$112.00"},"PAGADO"]
[13,"PIONERO FORTIS","CPF",5,0,0,{"v":80,"d":"$80.00"},"PAGADO"]
[14,"SEUL","SEU",9,6,{"v":10,"d":"$10.00"},{"v":164,"d":"$164.00"},"PAGADO"]
[15,"SEUL","YEO",7,0,0,{"v":112,"d":"$112.00"},"PAGADO"]
[16,"SHOGUN SHOGUN","OHS",3,0,0,{"v":48,"d":"$48.00"},"PAGADO"]
[17,"S. D. CENTRAL","SDC",12,0,{"v":192,"d":"$192.00"},0,"PAGADO"]
[18,"TOTAL KOMBAT","TKT",11,0,{"v":80,"d":"$80.00"},{"v":96,"d":"$96.00"},"PAGADO"]
[19,"BORJA'S LIONS","BLS",0,1,0,0,"NO PARTICIPA"]
[20,"DECIAP","DEC",0,1,0,0,"PASO POR USO SISTEMA"]
[21,"ILYO. MP","ILY",0,1,{"v":5,"d":"$5.00"},0,"PAGADO"]
[22,"KO AMERICA","KOA",0,2,{"v":10,"d":"$10.00"},0,"PAGADO"]
[23,"KORYO","KOR",0,1,{"v":5,"d":"$5.00"},0,"PAGADO"]
[24,"LEON","LEO",0,1,0,{"v":5,"d":"$5.00"},"PAGADO"]
[25,"LOS PUMAS","PUM",0,1,0,{"v":5,"d":"$5.00"},"PAGADO"]
[26,"MERCENARIOS","MER",0,2,{"v":10,"d":"$10.00"},0,"PAGADO"]
[27,"ROJAS IAN IRON FIST","PVM",0,1,0,0,"NO PARTICIPA"]
[28,"TAE BAEK","TBK",0,1,0,{"v":1,"d":"$1.00"},"PAGADO"]
[29,"TAE SHO KU","TSK",0,1,0,{"v":5,"d":"$5.00"},"PAGADO"]
[30,"USFQ","USF",0,1,{"v":5,"d":"$5.00"},0,"PAGADO"]
[31,"YONG TIGER","YON",0,2,{"v":5,"d":"$5.00"},{"v":5,"d":"$5.00"},"PAGADO"]
["TOTAL ",null,null,{"$f":"SUM(D6:D36)","v":155},{"$f":"SUM(E6:E36)","v":26},{"$f":"SUM(F6:F36)","v":{"v":1325,"d":"$1,325.00"}},{"$f":"SUM(G6:G36)","v":{"v":1235,"d":"$1,235.00"}},{"$f":"SUM(F37:G37)","v":{"v":2560,"d":"$2,560.00"}}]
[]
[]
[null,"INGRESOS"]
[null,"INSCRIPCIONES EFECTIVO",{"$f":"F37","v":{"v":1325,"d":"$ 1,325.00"}}]
[null,"INSCRIPCIONES TRANSFERENCIA",{"$f":"G37","v":{"v":1235,"d":"$ 1,235.00"}}]
[null,"TAQUILLA",{"v":301,"d":"$ 301.00"}]
[null,"TOTAL",{"$f":"SUM(C41:C43)","v":{"v":2861,"d":"$ 2,861.00"}}]
[]
[]
[null,"EGRESOS"]
[null,"PRODUCTOS DE CAFETERÍA",{"v":6.25,"d":"$ 6.25"}]
[null,"COMPRA DE MICRÓFONO Y MOVILIZACIÓN",{"v":12.9,"d":"$ 12.90"}]
[null,"TRANSPORTE DE MEDALLAS Y TROFEOS",{"v":13,"d":"$ 13.00"}]
[null,"TRANSPORTE PETOS ELECTRÓNICOS",{"v":16,"d":"$ 16.00"}]
[null,"MEDALLAS Y TROFEOS",{"v":300,"d":"$ 300.00"}]
[null,"PAGO ARBITRAJE",{"v":220,"d":"$ 220.00"}]
[null,"PAGO STAFF (PERSONAL DE APOYO)",{"v":260,"d":"$ 260.00"}]
[null,"GLOBOS PARA CIRCUITO DE HABILIDADES MOTRICES",{"v":8,"d":"$ 8.00"}]
[null,"ALQUILER DE INFLABLE",{"v":120,"d":"$ 120.00"}]
[null,"ALIMENTACIÓN STAFF (ALMUERZOS)",{"v":60,"d":"$ 60.00"}]
[null,"PAGO MONTAJE Y DESMONTAJE DE ESCENARIO",{"v":40,"d":"$ 40.00"}]
[null,"DEVOLUCIÓN GASTOS EXTRAS EN ALIMENTACIÓN CAMPEONATO NACIONAL",{"v":135,"d":"$ 135.00"}]
[null,"PAGO PENDIENTE EVENTO EN CIUDAD MITAD DEL MUNDO (ALIMENTACIÓN)",{"v":210,"d":"$ 210.00"}]
[null,"DIRECCIÓN CONGRESILLO - CAMBIOS DE CATEGORÍA - LLAVEAJE",{"v":100,"d":"$ 100.00"}]
[null,"PAGO STAFF DE BOLETERÍA (2 PERSONAS)",{"v":60,"d":"$ 60.00"}]
[null,"DIFUSIÓN Y COBERTURA DURANTE EL EVENTO",{"v":30,"d":"$ 30.00"}]
[null,"TOTAL",{"$f":"SUM(C48:C63)","v":{"v":1591.15,"d":"$ 1,591.15"}}]
[]
[]
[null,"INGRESOS",{"$f":"C44","v":{"v":2861,"d":"$ 2,861.00"}}]
[null,"EGRESOS",{"$f":"-C64","v":{"v":-1591.15,"d":"$ (1,591.15)"}}]
[null,"SALDO",{"$f":"C67+C68","v":{"v":1269.85,"d":"$ 1,269.85"}}]

{"sheet":"OPEN DE LA FAMILIA","index":6,"n_rows":48,"n_cols":8,"rows_kept":48,"merged":[[0,0,0,7],[1,0,1,7],[2,0,2,7],[3,0,3,7],[21,0,21,2],[24,1,24,2],[31,1,31,2]]}
["ASOCIACIÓN DE TAEKWONDO DE PICHINCHA"]
["      OPEN POR EL DÍA DE LA FAMILIA"]
["COLISEO \"LOS QUITUS\" (04 DE MAYO DEL 2025)"]
[]
["Nº","CLUB","SIGLAS","TOTAL","PAREJA/TRÍO","PAGO EFECT.","PAGO TRANSF.","ESTADO DE PAGO"]
[1,"APOLO","APO",23,"10 par 1 trio",0,{"v":285,"d":"$285.00"},"PAGADO"]
[2,"ARES","ARE",14,"7 parejas",0,{"v":170,"d":"$170.00"},"PAGADO"]
[3,"BAS PANTHERS","BSP",7,"2 par 1 trio",{"v":85,"d":"$85.00"},0,"PAGADO"]
[4,"DOJANG TKD MELO","DTM",2,"1 pareja",0,{"v":25,"d":"$25.00"},"PAGADO"]
[5,"ECUADOR","ECU",5,"1 par 1 trio",{"v":60,"d":"$60.00"},0,"PAGADO"]
[6,"EQUILIBRIO","EQU",5,"1 par 1 trio",0,{"v":60,"d":"$60.00"},"PAGADO"]
[7,"HIMCHARI DOJANG","HIM",8,"4 parejas",0,{"v":100,"d":"$100.00"},"PAGADO"]
[8,"JI TAE","JIT",5,"1 par 1 trio",{"v":60,"d":"$60.00"},0,"PAGADO"]
[9,"MOODUKKWAN T. C.","TTC",4,"2 parejas",0,{"v":50,"d":"$50.00"},"PAGADO"]
[10,"SEUL","SEU",6,"3 parejas",0,{"v":75,"d":"$75.00"},"PAGADO"]
[11,"SEUL","YEO",2,"1 pareja",0,{"v":25,"d":"$25.00"},"PAGADO"]
[12,"S. D . CENTRAL","SDC",7,"2 par 1 trio",0,{"v":85,"d":"$85.00"},"PAGADO"]
[13,"TAEGUK JUCARO","TJD",2,"1 pareja",{"v":25,"d":"$25.00"},0,"PAGADO"]
[14,"TOTAL KOMBAT","TKT",17,"7 par 1 trio",0,{"v":210,"d":"$210.00"},"PAGADO"]
[15,"UE TECNICO SUCRE","JOL",2,"1parejas",0,{"v":25,"d":"$25.00"},"PAGADO"]
[16,"VENOM","VNM",5,"1 par1 trio",{"v":60,"d":"$60.00"},0,"PAGADO"]
["TOTAL",null,null,{"$f":"SUM(D6:D21)","v":114},"43 par 7 trios",{"$f":"SUM(F6:F21)","v":{"v":290,"d":"$290.00"}},{"$f":"SUM(G6:G21)","v":{"v":1110,"d":"$1,110.00"}},{"$f":"SUM(F22:G22)","v":{"v":1400,"d":"$1,400.00"}}]
[]
[]
[null,"INGRESOS"]
[null,"INSCRIPCIONES EFECTIVO",{"$f":"F22","v":{"v":290,"d":"$ 290.00"}}]
[null,"INSCRIPCIONES TRANSFERENCIA",{"$f":"G22","v":{"v":1110,"d":"$ 1,110.00"}}]
[null,"TAQUILLA",{"v":50,"d":"$ 50.00"}]
[null,"TOTAL",{"$f":"SUM(C26:C28)","v":{"v":1450,"d":"$ 1,450.00"}}]
[]
[]
[null,"EGRESOS"]
[null,"MEDALLAS",{"v":120,"d":"$ 120.00"}]
[null,"PAGO ARBITRAJE",{"v":100,"d":"$ 100.00"}]
[null,"PAGO STAFF",{"v":110,"d":"$ 110.00"}]
[null,"PAGO MONTAJE Y DESMONTAJE DE ESCENARIO",{"v":25,"d":"$ 25.00"}]
[null,"ELABORACIÓN DE LLAVES ",{"v":70,"d":"$ 70.00"}]
[null,"SISTEMAS DE COMPETENCIA",{"v":30,"d":"$ 30.00"}]
[null,"MOVILIZACIÓN Y TRANSPORTE ",{"v":15,"d":"$ 15.00"}]
[null,"PAGO POR SISTEMA DE INSCRIPCIÓN A EVENTOS",{"v":110,"d":"$ 110.00"}]
[null,"ALIMENTACIÓN STAFF (ÁRBITROS Y PERSONAL DE APOYO)",{"v":62,"d":"$ 62.00"}]
[null,"DIFUSIÓN Y COBERTURA DURANTE EL EVENTO",{"v":20,"d":"$ 20.00"}]
[null,"TOTAL",{"$f":"SUM(C33:C42)","v":{"v":662,"d":"$ 662.00"}}]
[]
[]
[null,"INGRESOS",{"$f":"C29","v":{"v":1450,"d":"$ 1,450.00"}}]
[null,"EGRESOS",{"$f":"-C43","v":{"v":-662,"d":"$ (662.00)"}}]
[null,"SALDO",{"$f":"C46+C47","v":{"v":788,"d":"$ 788.00"}}]

{"sheet":"CAMPEONATO ESCOLAR - COLEGIAL","index":7,"n_rows":153,"n_cols":13,"rows_kept":153,"merged":[[0,0,0,8],[1,0,1,8],[2,0,2,8],[3,0,3,8],[103,0,103,2],[106,1,106,2],[113,1,113,2],[149,1,149,2]]}
["ASOCIACIÓN DE TAEKWONDO DE PICHINCHA"]
["CAMPEONATO ESCOLAR - COLEGIAL"]
["COLISEO \"RUMIÑAHUI\" (10 DE MAYO DEL 2025)"]
[]
["Nº","CLUB","SIGLAS","DEPORTISTAS INSCRITOS","CAMBIO DE CATEGORÍA","PAGO EFECT.","PAGO TRANSF.","ESTADO DE PAGO","ENTRENADOR"]
[1,"UE AIDA GALLEGOS DE MONCAYO","AGM",1,0,0,{"v":15,"d":"$15.00"},"PAGADO"]
[2,"U.E.BRETHREN","BRE",1,1,0,{"v":15,"d":"$15.00"},"PAGADO"]
[3,"UE 13 DE ABRIL","ABR",2,0,0,{"v":23,"d":"$23.00"},"PAGADO"]
[4,"UE ODILO AGUILAR","SEU",1,0,{"v":15,"d":"$15.00"},0,"PAGADO"]
[5,"UE ALFRED BINET","AYA",1,0,0,{"v":15,"d":"$15.00"},"PAGADO"]
[6,"UE ALFREDO CISNEROS","CIS",31,4,{"v":75,"d":"$75.00"},{"v":410,"d":"$410.00"},"PAGADO"]
[7,"UE ALTO CENEPA","BKJ",4,0,{"v":60,"d":"$60.00"},0,"PAGADO"]
[8,"UE ALVERNIA","UEA",2,0,0,{"v":30,"d":"$30.00"},"PAGADO"]
[9,"UE AMERICA LATINA","BKJ",1,0,{"v":15,"d":"$15.00"},0,"PAGADO"]
[10,"UE ANAN","ANA",1,0,0,{"v":15,"d":"$15.00"},"PAGADO"]
[11,"UE ANDRES F CORDOVA","AFC",1,0,0,{"v":15,"d":"$15.00"},"PAGADO"]
[12,"UE ANDRES F CORDOVA","AFC",1,0,0,{"v":15,"d":"$15.00"},"PAGADO"]
[13,"UE ANTONIO FLORES","CAF",47,0,0,{"v":600,"d":"$600.00"},"PAGADO"]
[14,"UE AVIACION CIVIL","AVI",1,0,0,{"v":15,"d":"$15.00"},"PAGADO"]
[15,"UE CARDENAL ESPINOLA FE Y ALEGRIA","UFA",2,0,0,{"v":23,"d":"$23.00"},"PAGADO"]
[16,"UE CARLOS ALVAREZ MINO SUIZO","BKJ",1,0,{"v":15,"d":"$15.00"},0,"PAGADO"]
[17,"UE CELIANO MONJE","UCM",1,0,0,{"v":15,"d":"$15.00"},"PAGADO"]
[18,"UE CENTRAL TECNICO","UCT",6,0,0,{"v":69,"d":"$69.00"},"PAGADO"]
[19,"UE CIUDAD DE BERGEN","CDB",1,0,0,{"v":15,"d":"$15.00"},"PAGADO"]
[20,"UE CLUB ARABE ECUATORIANO","BKJ",2,0,{"v":30,"d":"$30.00"},0,"PAGADO"]
[21,"UE COLEGIO ABDON CALDERON","BKJ",3,0,{"v":45,"d":"$45.00"},0,"PAGADO"]
[22,"UE COLEGIO AMERICANO DE QUITO","AME",1,0,0,{"v":15,"d":"$15.00"},"PAGADO"]
[23,"UE COLEGIO FRANCES","FRA",1,0,0,{"v":15,"d":"$15.00"},"PAGADO"]
[24,"UE COLEGIO GIOVANNI A FARINA","GAF",15,0,0,{"v":175,"d":"$175.00"},"PAGADO"]
[25,"UE COLEGIO GONZAGA","TKG",10,0,0,{"v":207,"d":"$207.00"},"PAGADO"]
[26,"UE COLEGIO MILITAR ELOY ALFARO N1","AYA",6,0,{"v":53,"d":"$53.00"},{"v":30,"d":"$30.00"},"PAGADO"]
[27,"UE COLEGIO SURCOS","SUR",2,0,0,{"v":30,"d":"$30.00"},"PAGADO"]
[28,"UE CDP - ASO TKD 5 EXONERADOS","CDP",45,0,{"v":600,"d":"$600.00"},0,"PAGADO"]
[29,"UE CONSEJO PROVINCIAL DE PICHINCHA","CPP",73,1,{"v":162,"d":"$162.00"},{"v":800,"d":"$800.00"},"PAGADO"]
[30,"UE DOCTOR GOLEMAN","GOL",2,0,0,{"v":30,"d":"$30.00"},"PAGADO"]
[31,"UE EEBF GUAYAQUIL","UEG",2,0,{"v":23,"d":"$23.00"},0,"PAGADO"]
[32,"UE EIGHT ACADEMY","EAC",8,0,0,{"v":92,"d":"$92.00"},"PAGADO"]
[33,"UE EL COLEGIO DE LIGA","CDL",17,0,0,{"v":227,"d":"$227.00"},"PAGADO"]
[34,"UE EL PARVULARIO  2 PARA TKD","UEP",2,0,{"v":7.5,"d":"$7.50"},{"v":7.5,"d":"$7.50"},"PAGADO"]
[35,"UE EMAUS FE Y ALEGRIA","EMA",1,0,0,{"v":23,"d":"$23.00"},"PAGADO"]
[36,"UE ESCUELA C.D. DE PICHINCHA","AYA",5,0,0,{"v":75,"d":"$75.00"},"PAGADO"]
[37,"UE EUFRACIA","EEU",3,0,0,{"v":38,"d":"$38.00"},"PAGADO","fact 4,5"]
[38,"UE GARDNER ACADEMY","UEG",1,0,0,{"v":15,"d":"$15.00"},"PAGADO"]
[39,"UE GEORGE MASON","GMA",1,0,0,{"v":15,"d":"$15.00"},"PAGADO"]
[40,"UE INDIRA GANDHI","IGA",1,0,0,{"v":15,"d":"$15.00"},"PAGADO"]
[41,"UE INES GANGOTENA JIJON","IGJ",24,2,0,{"v":370,"d":"$370.00"},"PAGADO"]
[42,"UE ING JUAN SUAREZ CHACON","JSC",1,0,{"v":15,"d":"$15.00"},0,"PAGADO"]
[43,"UE ISM QUITO","BKJ",2,0,{"v":30,"d":"$30.00"},{"v":15,"d":"$15.00"},"PAGADO"]
[44,"UE JACQUES BOSSUET","EJB",1,0,0,0,"NO VINO"]
[45,"UE JHON KEYNES","UJK",4,0,0,{"v":60,"d":"$60.00"},"PAGADO"]
[46,"UE JOSE MARIA VELASCO IBARRA","UVI",1,0,0,{"v":15,"d":"$15.00"},"PAGADO"]
[47,"UE JOSE MARIA VELAZ","JMV",3,0,0,{"v":30,"d":"$30.00"},"PAGADO"]
[48,"UE JUAN DE SALINAS","UJS",1,1,0,{"v":20,"d":"$20.00"},"PAGADO"]
[49,"UE JUAN PIO MONTUFAR","JPM",18,1,0,{"v":212,"d":"$212.00"},"PAGADO"]
[50,"UE JULIO ENRIQUE MORENO","JEM",2,0,0,{"v":30,"d":"$30.00"},"PAGADO"]
[51,"UE JUNTA NACIONAL DE LA VIVIENDA","UJV",3,0,0,{"v":45,"d":"$45.00"},"PAGADO"]
[52,"UE KARL POOPER VGH","POO",1,0,0,{"v":17,"d":"$17.00"},"PAGADO"]
[53,"UE LA CONDAMINE","CON",1,0,0,{"v":15,"d":"$15.00"},"PAGADO"]
[54,"UE LA PROVIDENCIA","AYA",1,0,0,{"v":15,"d":"$15.00"},"PAGADO"]
[55,"UE LA SALLE CONOCOTO","SAL",1,0,0,{"v":15,"d":"$15.00"},"PAGADO"]
[56,"UE LAS ABEJITAS DEL SUR","AYA",1,0,0,{"v":15,"d":"$15.00"},"PAGADO"]
[57,"UE LEV VYGOTSKY","LVY",1,0,0,{"v":15,"d":"$15.00"},"PAGADO"]
[58,"UE LICEO MATOVELLE","ULM",2,0,{"v":30,"d":"$30.00"},0,"PAGADO"]
[59,"UE LICEO NAVAL QUITO","LNQ",35,2,0,{"v":544,"d":"$544.00"},"PAGADO"]
[60,"UE LICEO ORTEGA Y GASSET","LOG",4,0,0,{"v":30,"d":"$30.00"},"PAGADO"]
[61,"UE LICEO POLICIAL","POL",1,0,0,{"v":15,"d":"$15.00"},"PAGADO"]
[62,"UE LOS PINOS","LPN",2,"o",{"v":15,"d":"$15.00"},{"v":15,"d":"$15.00"},"PAGADO"]
[63,"UE LUIGI GALVANI","SEU",1,0,{"v":15,"d":"$15.00"},0,"PAGADO"]
[64,"UE LUIS FELIPE DE ALCAZAR","LFA",3,0,{"v":30,"d":"$30.00"},0,"PAGADO"]
[65,"UE LUIS FRELIPE BORJA","LFB",1,0,0,{"v":15,"d":"$15.00"},"PAGADO"]
[66,"UE MANUELA SAENZ AIZPURU","MSA",31,0,0,{"v":465,"d":"$465.00"},"PAGADO"]
[67,"UE MARTIN CERERE","MCE",1,1,0,{"v":20,"d":"$20.00"},"PAGADO"]
[68,"UE MASLOW","MSL",1,0,0,{"v":15,"d":"$15.00"},"PAGADO"]
[69,"UE MAURICE RAVELL","MRV",2,0,0,{"v":23,"d":"$23.00"},"PAGADO"]
[70,"UE MIGUEL DE UNAMUNO","AYA",1,0,0,{"v":15,"d":"$15.00"},"PAGADO"]
[71,"UE MITAD DEL MUNDO","UMM",31,0,0,{"v":465,"d":"$465.00"},"PAGADO"]
[72,"UE MUNICIPAL CALDERON","BKJ",2,0,{"v":30,"d":"$30.00"},0,"PAGADO"]
[73,"UE MUNICIPAL MILENIO BICENTENARIO","BIC",15,2,0,{"v":235,"d":"$235.00"},"PAGADO"]
[74,"UE NAVARRA","NAV",3,0,0,{"v":45,"d":"$45.00"},"PAGADO"]
[75,"UE NUEVA AURORA","DMA",1,0,0,{"v":15,"d":"$15.00"},"PAGADO",null,null," "]
[76,"UE NUEVA AURORA","NAU",3,0,0,{"v":30,"d":"$30.00"},"PAGADO"]
[77,"UE OSWALDO GUAYASAMIN","AYA",2,0,0,{"v":30,"d":"$30.00"},"PAGADO"]
[78,"UE POMASQUI","POM",1,0,0,0,"PENDIENTE","Edison R"]
[79,"UE RED ACADEMY","RED",3,0,0,{"v":45,"d":"$45.00"},"PAGADO"]
[80,"UE REPLICA MONTUFAR","MON",9,0,0,{"v":135,"d":"$135.00"},"PAGADO"]
[81,"UE REPUBLICA DE ITALIA","UEI",1,0,0,{"v":15,"d":"$15.00"},"PAGADO"]
[82,"UE REPUBLICA FEDERAL ALEMANIA","SEU",1,0,{"v":15,"d":"$15.00"},0,"PAGADO"]
[83,"UE REPUBLICA FEDERAL SUIZA","BKJ",1,0,{"v":15,"d":"$15.00"},0,"PAGADO"]
[84,"UE SAGRADOS CORAZONE RUMIPAMBA","RUM",11,0,0,{"v":211,"d":"$211.00"},"PAGADO"]
[85,"UE SAINT DOMINI SCHOOL","SDM",1,0,0,{"v":15,"d":"$15.00"},"PAGADO"]
[86,"UE SAINT PATRICK SCHOOL","SPS",1,0,{"v":15,"d":"$15.00"},0,"PAGADO"]
[87,"UE SALESIANA DON BOSCO","DBT",1,0,0,0,"NO VINO"]
[88,"UE SAN VICENTE DE PAUL","VCP",1,1,{"v":10,"d":"$10.00"},{"v":10,"d":"$10.00"},"PAGADO"]
[89,"UE SANTO TOMAS DE AQUINO","STA",1,0,0,{"v":15,"d":"$15.00"},"PAGADO"]
[90,"UE SAUL O","BKJ",1,0,{"v":15,"d":"$15.00"},0,"PAGADO",{"$nulls":4},0]
[91,"UE SAUL O","UES",1,0,{"v":15,"d":"$15.00"},0,"PAGADO"]
[92,"UE SEBASTIAN DE BENALCAZAR","BEN",24,4,0,{"v":380,"d":"$380.00"},"PAGADO"]
[93,"UE SEMIONOVYCH","SEM",2,0,0,{"v":15,"d":"$15.00"},"PAGADO"]
[94,"UE SIMON BOLIVAR","CSB",4,0,0,{"v":60,"d":"$60.00"},"PAGADO"]
[95,"UE TECNICO SUCRE","SUC",78,1,0,{"v":1175,"d":"$1,175.00"},"PAGADO"]
[96,"UE WILLIAM CAXTON","BKJ",1,0,{"v":15,"d":"$15.00"},0,"PAGADO"]
[97,"UE WILLIAM CAXTON","CAX",1,0,0,{"v":15,"d":"$15.00"},"PAGADO"]
[98,"UE WILLIAM CAXTON","SEU",3,0,0,{"v":45,"d":"$45.00"},"PAGADO"]
["TOTAL",null,null,{"$f":"SUM(D6:D103)","v":662},{"$f":"SUM(E6:E103)","v":21},{"$f":"SUM(F6:F103)","v":{"v":1365.5,"d":"$1,365.50"}},{"$f":"SUM(G6:G103)","v":{"v":8101.5,"d":"$8,101.50"}},{"$f":"F104+G104","v":{"v":9467,"d":"$9,467.00"}}]
[]
[]
[null,"INGRESOS"]
[null,"INSCRIPCIONES EFECTIVO",{"$f":"F104","v":{"v":1365.5,"d":"$ 1,365.50"}}]
[null,"INSCRIPCIONES TRANSFERENCIA",{"$f":"G104","v":{"v":8101.5,"d":"$ 8,101.50"}}]
[null,"TAQUILLA",{"v":933,"d":"$ 933.00"}]
[null,"TOTAL",{"$f":"SUM(C108:C110)","v":{"v":10400,"d":"$ 10,400.00"}}]
[]
[]
[null,"EGRESOS"]
[null,"DEVOLUCIÓN PAGO DE INSCRIPCIÓN (CANCELA UN VALOR MAYOR)",{"v":21,"d":"$ 21.00"}]
[null,"PAGO ARBITRAJE ",{"v":1520,"d":"$ 1,520.00"}]
[null,"AGUA STAFF (ÁRBITROS Y P. APOYO)",{"v":20.81,"d":"$ 20.81"}]
[null,"COMPRA DE PRODUCTOS DE LIMPIEZA",{"v":17.01,"d":"$ 17.01"}]
[null,"ORGANIZACIÓN Y DIRECCIÓN DEL EVENTO",{"v":120,"d":"$ 120.00"}]
[null,"ALIMENTACIÓN STAFF (DESAYUNO)",{"v":87.5,"d":"$ 87.50"}]
[null,"ALIMENTACIÓN STAFF (ALMUERZO)",{"v":81,"d":"$ 81.00"}]
[null,"PAGO POR SISTEMA DE INSCRIPCIÓN A EVENTOS",{"v":553.3,"d":"$ 553.30"}]
[null,"PAGO IMPRESIÓN DE BOLETOS PARA EXHIBICIÓN",{"v":342,"d":"$ 342.00"}]
[null,"SISTEMAS DE COMPETENCIA",{"v":80,"d":"$ 80.00"}]
[null,"APOYO Y MANEJO DE SISTEMA DE COMPETENCIA",{"v":30,"d":"$ 30.00"}]
[null,"ALQUILER DE TELEVISOR",{"v":60,"d":"$ 60.00"}]
[null,"DIRECCIÓN CONGRESILLO - CAMBIOS DE CATEGORÍA - LLAVEAJE",{"v":170,"d":"$ 170.00"}]
[null,"ALQUILER DE COMPUTADORAS PARA EVENTO",{"v":40,"d":"$ 40.00"}]
[null,"MEDALLAS",{"v":580,"d":"$ 580.00"}]
[null,"TROFEOS",{"v":250,"d":"$ 250.00"}]
[null,"ALQUILER DE SISTEMAS DE POOMSAE Y ARBITRAJE (ÁNGELO CORDERO) ",{"v":115,"d":"$ 115.00"}]
[null,"ALQUILER DE SISTEMAS DE POOMSAE Y ARBITRAJE (DUAN YUXI)",{"v":100,"d":"$ 100.00"}]
[null,"IMPRESIÓN DE STICKER PARA MEDALLAS (250)",{"v":62.5,"d":"$ 62.50"}]
[null,"SONIDO Y AMPLIFICACIÓN EN EVENTO",{"v":150,"d":"$ 150.00"}]
[null,"PERSONAL MÉDICO (3)",{"v":130,"d":"$ 130.00"}]
[null,"PAGO MONTAJE Y DESMONTAJE DE ESCENARIO Y FLETES",{"v":150,"d":"$ 150.00"}]
[null,"DIFUSIÓN Y COBERTURA DURANTE EL EVENTO",{"v":30,"d":"$ 30.00"}]
[null,"DIRECCIÓN Y ORGANIZACIÓN DE CIRCUITO DE HABILIDADES",{"v":40,"d":"$ 40.00"}]
[null,"LIMPIEZA DE BAÑOS Y ESCENARIO",{"v":30,"d":"$ 30.00"}]
[null,"PAGO STAFF DE BOLETERÍA (2 PERSONAS)",{"v":60,"d":"$ 60.00"}]
[null,"PAGO STAFF (PERSONAL DE APOYO)",{"v":370,"d":"$ 370.00"}]
[null,"TOTAL",{"$f":"SUM(C115:C141)","v":{"v":5210.12,"d":"$ 5,210.12"}}]
[]
[]
[null,"INGRESOS",{"$f":"C111","v":{"v":10400,"d":"$ 10,400.00"}}]
[null,"EGRESOS",{"$f":"-C142","v":{"v":-5210.12,"d":"$ (5,210.12)"}}]
[null,"SALDO",{"$f":"C145+C146","v":{"v":5189.88,"d":"$ 5,189.88"}}]
[]
[]
[null,"POR COBRAR"]
[null,"CLUB","VALOR"]
[null,{"$f":"B83","v":"UE POMASQUI"},{"v":15,"d":"$ 15.00"}]
[null,"TOTAL",{"$f":"SUBTOTAL(9,C152:C152)","v":{"v":15,"d":"$ 15.00"}}]

{"sheet":"II OPEN INT NOV AVA POOM","index":8,"n_rows":110,"n_cols":11,"rows_kept":110,"merged":[[0,0,0,10],[1,0,1,10],[2,0,2,10],[61,0,61,2],[63,1,63,2],[69,1,69,2],[106,1,106,2]]}
["ASOCIACIÓN DE TAEKWONDO DE PICHINCHA"]
["   II OPEN NOVATOS - INTERMEDIOS COMBATE Y POOMSAE  - PRIMER OPEN POOMSAE AVANZADO"]
["COLISEO \"RUMIÑAHUI\" 5Y6-07-2025"]
[]
["Nº","CLUB","SIGLAS","NOVAT-INTERM COMB-POOM","POOMSAE AVANZADO","CAMBIO DE CATEGORÍA","INSCRIP. TARDÍA","PAGO EFECT.","PAGO TRANSF.","TOTAL","ESTADO DE PAGO"]
[1,"APOLO","APO",9,"-","-",1,0,{"v":148,"d":"$148.00"},{"$f":"H6+I6","v":{"v":148,"d":"$148.00"}},"PAGADO"]
[2,"APOLO","APO",31,2,1,"-",0,{"v":533,"d":"$533.00"},{"v":533,"d":"$533.00"},"PAGADO"]
[3,"ARES","ARE",23,1,"-","-",{"v":384,"d":"$384.00"},0,{"v":384,"d":"$384.00"},"PAGADO"]
[4,"ASOCIACION DE TKDP","ASO",18,"-",3,"-",{"v":287,"d":"$287.00"},0,{"v":287,"d":"$287.00"},"PAGADO"]
[5,"ATLAS","ATL",9,"-","-","-",0,{"v":144,"d":"$144.00"},{"v":144,"d":"$144.00"},"PAGADO"]
[6,"BAEKJUL AYALA","BKJ",25,"-","-","-",0,{"v":400,"d":"$400.00"},{"v":400,"d":"$400.00"},"PAGADO"]
[7,"BAEKJUL TAEKWONDO","BKJ",17,"-","-","-",{"v":272,"d":"$272.00"},0,{"v":272,"d":"$272.00"},"PAGADO"]
[8,"BAEKJUL FERNANDEZ","BKJ",8,"-",1,"-",0,{"v":133,"d":"$133.00"},{"v":133,"d":"$133.00"},"PAGADO"]
[9,"BAS PANTHERS","BSP",10,"-",1,1,0,{"v":169,"d":"$169.00"},{"v":169,"d":"$169.00"},"PAGADO"]
[10,"BLUE DRAGONS","BDR",19,"-",3,"-",0,{"v":319,"d":"$319.00"},{"v":319,"d":"$319.00"},"PAGADO"]
[11,"BORJA’S LIONS","BLS",47,"-",1,"-",0,{"v":757,"d":"$757.00"},{"v":757,"d":"$757.00"},"PAGADO"]
[12,"CHAMPIONS FOR LIFE","CFL",13,"-","-",2,0,{"v":216,"d":"$216.00"},{"v":216,"d":"$216.00"},"PAGADO"]
[13,"CHUNG SONG","CHS",21,"-",1,3,0,{"v":353,"d":"$353.00"},{"v":353,"d":"$353.00"},"PAGADO"]
[14,"CIUDAD DE QUITO","CDQ",5,1,"-","-",0,{"v":96,"d":"$96.00"},{"v":96,"d":"$96.00"},"PAGADO"]
[15,"CLUB  YONG TIGER ELITE","YON",7,1,"-","-",{"v":10,"d":"$10.00"},{"v":70,"d":"$70.00"},{"v":80,"d":"$80.00"},"DEBE 48"]
[16,"CLUB  HAN KUM DO","HKD",16,"-","-","-",0,{"v":256,"d":"$256.00"},{"v":256,"d":"$256.00"},"PAGADO"]
[17,"CLUB JOSEON LEGACY  2","JOL",25,1,1,"-",0,{"v":391,"d":"$391.00"},{"v":391,"d":"$391.00"},"PAGADO"]
[18,"DEBAK TKD","DBK",61,13,"-","-",0,0,0,"PAGADO"]
[19,"DOJANG TKD MELO","DTM",9,1,"-","-",0,{"v":160,"d":"$160.00"},{"v":160,"d":"$160.00"},"PAGADO"]
[20,"DRACO","DRA",7,"-",1,7,0,{"v":145,"d":"$145.00"},{"v":145,"d":"$145.00"},"PAGADO"]
[21,"ECUADCUBA","ECB",31,"-","-",1,{"v":500,"d":"$500.00"},0,{"v":500,"d":"$500.00"},"PAGADO"]
[22,"ECUADOR","ECU",3,"-","-","-",0,{"v":48,"d":"$48.00"},{"v":48,"d":"$48.00"},"PAGADO"]
[23,"ESPE","ESP",14,"-",1,1,0,{"v":233,"d":"$233.00"},{"v":233,"d":"$233.00"},"PAGADO"]
[24,"FURIA NEGRA","CFN",7,"-","-","-",0,{"v":112,"d":"$112.00"},{"v":112,"d":"$112.00"},"PAGADO"]
[25,"GOYANG-IDEUL","AGI",3,"-",3,"-",0,{"v":66,"d":"$66.00"},{"v":66,"d":"$66.00"},"PAGADO"]
[26,"ILYO M.P","ILY",9,"-",3,2,0,{"v":167,"d":"$167.00"},{"v":167,"d":"$167.00"},"PAGADO"]
[27,"JERATHEL","JER",3,1,"-","-",0,{"v":64,"d":"$64.00"},{"v":64,"d":"$64.00"},"PAGADO"]
[28,"KO AMERICA","KOA",34,"-",4,1,{"v":118,"d":"$118.00"},{"v":450,"d":"$450.00"},{"v":568,"d":"$568.00"},"PAGADO"]
[29,"KOREAN DRAGON","KDR",10,"-","-","-",0,{"v":160,"d":"$160.00"},{"v":160,"d":"$160.00"},"PAGADO"]
[30,"KUKKIWON","KUK",8,"-",3,1,{"v":147,"d":"$147.00"},0,{"v":147,"d":"$147.00"},"PAGADO"]
[31,"KUMGANG DUL","KGD",5,"-","-","-",0,{"v":80,"d":"$80.00"},{"v":80,"d":"$80.00"},"PAGADO"]
[32,"KYORUGUI GYM","KRG",18,"-",2,2,0,{"v":306,"d":"$306.00"},{"v":306,"d":"$306.00"},"PAGADO"]
[33,"LEON","LEO",24,"-",3,2,{"v":147,"d":"$147.00"},{"v":260,"d":"$260.00"},{"$f":"H38+I38","v":{"v":407,"d":"$407.00"}},"PAGADO"]
[34,"LIGA CANTONAL DE MEJÍA","LCM",6,"-","-",1,{"v":100,"d":"$100.00"},0,{"v":100,"d":"$100.00"},"PAGADO"]
[35,"LOS PUMAS","PUM",25,"-",2,"-",0,{"v":410,"d":"$410.00"},{"v":410,"d":"$410.00"},"PAGADO"]
[36,"MARCIAL CLUB GRANDA","MCG",13,"-","-","-",0,{"v":208,"d":"$208.00"},{"v":208,"d":"$208.00"},"PAGADO"]
[37,"MERCENARIOS","MER",12,"-","-","-",0,{"v":192,"d":"$192.00"},{"v":192,"d":"$192.00"},"PAGADO"]
[38,"MICHAYDO","MCD",5,"-",2,"-",0,{"v":90,"d":"$90.00"},{"v":90,"d":"$90.00"},"PAGADO"]
[39,"MINOTAUROS ECU","MIN",12,"-","-","-",0,{"v":192,"d":"$192.00"},{"v":192,"d":"$192.00"},"PAGADO"]
[40,"MOODUKKWAN TRAINING 2-4","TTC",22,11,"-",1,0,{"v":508,"d":"$508.00"},{"v":508,"d":"$508.00"},"PAGADO"]
[41,"MSA GRAND MASTER","MSA",2,"-","-","-",0,{"v":32,"d":"$32.00"},{"v":32,"d":"$32.00"},"PAGADO"]
[42,"PYONGYANG","PYO",11,"-","-","-",0,{"v":198,"d":"$198.00"},{"v":198,"d":"$198.00"},"PAGADO"]
[43,"ROJAS IAN IRON FIST  Susana","PVM",10,"-","-","-",0,{"v":160,"d":"$160.00"},{"v":160,"d":"$160.00"},"PAGADO"]
[44,"SAN FRANCISCO TIGRES","SFT",9,3,"-","-",{"v":192,"d":"$192.00"},0,{"v":192,"d":"$192.00"},"PAGADO"]
[45,"SAN SEBASTIAN","SSB",17,2,"-","-",{"v":32,"d":"$32.00"},{"v":256,"d":"$256.00"},{"v":288,"d":"$288.00"},"PAGADO"]
[46,"SEUL","SEU",1,"-","-","-",0,{"v":18,"d":"$18.00"},{"v":18,"d":"$18.00"},"PAGADO"]
[47,"SHOGUN","OHS",14,1,"-","-",0,{"v":240,"d":"$240.00"},{"v":240,"d":"$240.00"},"PAGADO"]
[48,"S.D.CENTRAL","SDC",45,"-",4,9,{"v":200,"d":"$200.00"},{"v":569,"d":"$569.00"},{"v":769,"d":"$769.00"},"PAGADO"]
[49,"SURYUN","SRY",26,"-","-",9,{"v":100,"d":"$100.00"},{"v":352,"d":"$352.00"},{"v":452,"d":"$452.00"},"PAGADO"]
[50,"TAE BAEK","TBK",2,"-",1,"-",0,{"v":44,"d":"$44.00"},{"v":44,"d":"$44.00"},"PAGADO"]
[51,"TAE BAEK JUNIOR","TBK",4,"-","-","-",0,{"v":64,"d":"$64.00"},{"v":64,"d":"$64.00"},"PAGADO"]
[52,"TAE SHO KU","TSK",3,2,"-","-",0,{"v":80,"d":"$80.00"},{"v":80,"d":"$80.00"},"PAGADO"]
[53,"TAEGUK JUCARO","TJD",8,1,"-",3,0,{"v":156,"d":"$156.00"},{"v":156,"d":"$156.00"},"PAGADO"]
[54,"TOTAL KOMBAT","TKT",15,"-","-","-",{"v":20,"d":"$20.00"},{"v":220,"d":"$220.00"},{"v":240,"d":"$240.00"},"PAGADO"]
[55,"UNIVERSIDAD UTE","UTE",8,"-","-","-",0,{"v":128,"d":"$128.00"},{"v":128,"d":"$128.00"},"PAGADO"]
[56,"RYONG TAE","RYT",0,1,"-","-",{"v":16,"d":"$16.00"},0,{"v":16,"d":"$16.00"},"PAGADO"]
["TOTAL",null,null,{"$f":"SUM(D6:D61)","v":819},42,41,47,{"v":2525,"d":"$2,525.00"},{"v":10353,"d":"$10,353.00"},{"v":12878,"d":"$12,878.00"}]
[]
[null,"INGRESOS"]
[null,"INSCRIPCIONES EFECTIVO + TRANSFERENCIA",{"$f":"J62","v":{"v":12878,"d":"$ 12,878.00"}}]
[null,"TAQUILLA",{"v":1307,"d":"$ 1,307.00"}]
[null,"TOTAL",{"$f":"SUM(C65:C66)","v":{"v":14185,"d":"$ 14,185.00"}}]
[]
[]
[null,"EGRESOS"]
[null,"TRANSPORTE (MEDALLAS Y TROFEOS)",{"v":30,"d":"$ 30.00"}]
[null,"DEVOLUCIÓN IVA POR FACTURA DE ÁRBITROS (PROF. JONATHAN CHICAIZA)",{"v":326,"d":"$ 326.00"}]
[null,"PAGO ARBITRAJE ",{"v":2060,"d":"$ 2,060.00"}]
[null,"TROFEOS - MEDALLAS ",{"v":1260,"d":"$ 1,260.00"}]
[null,"ALIMENTACIÓN STAFF (DESAYUNO Y ALMUERZO ÁRBITROS Y PERSONAL DE APOYO)",{"v":460,"d":"$ 460.00"}]
[null,"PAGO STAFF ",{"v":595,"d":"$ 595.00"}]
[null,"PAGO POR SISTEMA DE INSCRIPCIÓN A EVENTOS (DE 2 COMPETENCIAS)",{"v":1133,"d":"$ 1,133.00"}]
[null,"COLABORACIÓN PARA DEPORTISTAS JUEGOS NACIONALES",{"v":103.5,"d":"$ 103.50"}]
[null,"TRANSPORTE JUEGOS NACIONALES APOYO TÉCNICO PROF. WILSON RODRÍGUEZ",{"v":30,"d":"$ 30.00"}]
[null,"TROFEOS (2)- MEDALLAS PARA COMPLETAR PREMIACIÓN GENERAL ",{"v":26,"d":"$ 26.00"}]
[null,"SERVICIO DE AMBULACIA DURANTE EL EVENTO",{"v":200,"d":"$ 200.00"}]
[null,"ELABORACIÓN DE LLAVES Y 2 DÍAS DE TRABAJO FERNANDO MOYA ",{"v":410,"d":"$ 410.00"}]
[null,"DIRECCIÓN Y ORGANIZACIÓN DE CONGRESILLO",{"v":230,"d":"$ 230.00"}]
[null,"COLABORACIÓN PARA HABILITAR DEPORTISTAS EN LA WEB ASOTKDP",{"v":118.5,"d":"$ 118.50"}]
[null,"SISTEMAS DE COMPETENCIA Y CERTIFICADOS (COPA COREA)",{"v":136,"d":"$ 136.00"}]
[null,"AGUA Y PRODUCTOS DE LIMPIEZA",{"v":22.38,"d":"$ 22.38"}]
[null,"CINTAS PARA DIVISIÓN DE ÁREA DE COMPETENCIA EN TATAMI",{"v":13,"d":"$ 13.00"}]
[null,"PRODUCTOS DE LIMPIEZA (DÍA 2)",{"v":24.65,"d":"$ 24.65"}]
[null,"GASTOS VARIOS PARA REFRIGERIOS DURANTE EVENTO",{"v":12,"d":"$ 12.00"}]
[null,"DIFUSIÓN Y COBERTURA DURANTE EL EVENTO",{"v":60,"d":"$ 60.00"}]
[null,"ALQUILER DE TELEVISOR",{"v":20,"d":"$ 20.00"}]
[null,"PAGO STAFF DE BOLETERÍA (2 PERSONAS)",{"v":60,"d":"$ 60.00"}]
[null,"PAGO MONTAJE Y DESMONTAJE DE ESCENARIO Y FLETES",{"v":210,"d":"$ 210.00"}]
[null,"SONIDO Y AMPLIFICACIÓN EN EVENTO",{"v":250,"d":"$ 250.00"}]
[null,"SERVICIO DE LIMPIEZA (BAÑOS Y COLISEO)",{"v":180,"d":"$ 180.00"}]
[null,"ORGANIZACIÓN Y DIRECCIÓN DEL EVENTO",{"v":100,"d":"$ 100.00"}]
[null,"GASTOS VARIOS POR ORGANIZACIÓN Y DIRECCIÓN DEL EVENTO",{"v":40,"d":"$ 40.00"}]
[null,"TOTAL",{"$f":"SUM(C71:C97)","v":{"v":8110.03,"d":"$ 8,110.03"}}]
[]
[]
[]
[null,"INGRESOS",{"$f":"C67","v":{"v":14185,"d":"$ 14,185.00"}}]
[null,"EGRESOS",{"$f":"-C98","v":{"v":-8110.03,"d":"$ (8,110.03)"}}]
[null,"SALDO",{"$f":"C102+C103","v":{"v":6074.97,"d":"$ 6,074.97"}}]
[]
[]
[null,"POR COBRAR"]
[null,"CLUB","VALOR"]
[null,"YONG TIGER",{"v":48,"d":"$ 48.00"}]
[null,"TOTAL",{"$f":"SUBTOTAL(9,C109:C109)","v":{"v":48,"d":"$ 48.00"}}]

{"sheet":"ACTUALIZACIÓN DE ARBITRAJE","index":9,"n_rows":227,"n_cols":7,"rows_kept":227,"merged":[[0,0,0,6],[1,0,1,6],[2,0,2,6],[3,0,3,6],[191,0,191,3],[194,1,194,2],[200,1,200,2],[221,1,221,2]]}
["ASOCIACIÓN DE TAEKWONDO DE PICHINCHA"]
["CURSO DE ACTUALIZACIÓN DE ARBITRAJE DE COMBATE "]
["INSTALACIONES ASOTKD - P (18-19 DE JULIO DEL 2025)"]
[]
["N°","NOMBRE APELLIDO","CLUB","CARGO","PAGO EFECT.","PAGO TRANSF.","ESTADO DEL PAGO"]
[1," ELY ALVARADO","APOLO","ENTRENADOR CLUB FILIAL",{"v":15,"d":"$15.00"},0,"PAGADO"]
[2," EDISON GUALLICHICO","APOLO","ENTRENADOR CLUB FILIAL",0,{"v":15,"d":"$15.00"},"PAGADO"]
[3," MARIO PINTO","APOLO","DIRECTOR CLUB FILIAL",{"v":15,"d":"$15.00"},0,"PAGADO"]
[4,"JONATHAN GUALLICHICO","APOLO","MONITOR CLUB FILIAL",0,{"v":15,"d":"$15.00"},"PAGADO"]
[5,"ALEJANDRO ARAUJO","ARES","ARBITRO",{"v":15,"d":"$15.00"},0,"PAGADO"]
[6,"CARLOS MAGALLANES","ASO. TKDP","ENTRENADOR CLUB FILIAL",0,0,"PENDIENTE"]
[7," ALISON MESIAS","ATLAS CLUB","ARBITRO",0,{"v":15,"d":"$15.00"},"PAGADO"]
[8,"JONATHAN CHICAIZA","ATLAS CLUB","ARBITRO",{"v":15,"d":"$15.00"},0,"PAGADO"]
[9,"KEVIN ROSADO","ATLAS CLUB","ARBITRO",0,0,"PENDIENTE"]
[10,"XAVIER VARELA","ATLAS CLUB","ARBITRO",0,0,"EXONERADO"]
[11,"KELLY GALLARDO","ATLAS CLUB","ARBITRO",0,{"v":15,"d":"$15.00"},"PAGADO"]
[12," IÑAKI GUJARRO","BAEKJUL JORGE","MONITOR CLUB FILIAL",{"v":15,"d":"$15.00"},0,"PAGADO"]
[13,"NOEMI BURBANO DE LARA","BAEKJUL JORGE","MONITOR CLUB FILIAL",{"v":15,"d":"$15.00"},0,"PAGADO"]
[14,"JOSWAL FLORES","BAEKJUL JORGE","MONITOR CLUB FILIAL",{"v":15,"d":"$15.00"},0,"PAGADO"]
[15,"JORGE GUAÑUNA","BAEKJUL JORGE","MONITOR CLUB FILIAL",{"v":15,"d":"$15.00"},0,"PAGADO"]
[16,"ESTEFANIA GUAÑUNA","BAEKJUL JORGE","MONITOR CLUB FILIAL",{"v":15,"d":"$15.00"},0,"PAGADO"]
[17,"ANGEL FLORES","BAEKJUL JORGE","MONITOR CLUB FILIAL",{"v":15,"d":"$15.00"},0,"PAGADO"]
[18,"SCARLETH CHAVEZ","BAEKJUL JORGE","MONITOR CLUB FILIAL",{"v":15,"d":"$15.00"},0,"PAGADO"]
[19,"ALEX VIANA","BAEKJUL JORGE","MONITOR CLUB FILIAL",{"v":15,"d":"$15.00"},0,"PAGADO"]
[20,"JOHANN PROAÑO","BAEKJUL JORGE","ENTRENADOR CLUB FILIAL",{"v":15,"d":"$15.00"},0,"PAGADO"]
[21,"ERICK PROAÑO","BAEKJUL JORGE","ENTRENADOR CLUB FILIAL",{"v":15,"d":"$15.00"},0,"PAGADO"]
[22,"PAULA CABEZAS","BAEKJUL JORGE","MONITOR CLUB FILIAL",{"v":15,"d":"$15.00"},0,"PAGADO"]
[23,"DERLY PINTO","BAEKJUL AYALA","OYENTE",0,{"v":15,"d":"$15.00"},"PAGADO"]
[24,"JEREMY BERMEO","BAEKJUL AYALA","OYENTE",0,{"v":15,"d":"$15.00"},"PAGADO"]
[25,"DANIEL AYALA","BAEKJUL AYALA","ENTRENADOR CLUB FILIAL",0,{"v":15,"d":"$15.00"},"PAGADO"]
[26,"DOMÉNICA MUÑOZ","BAEKJUL AYALA","OYENTE",0,{"v":15,"d":"$15.00"},"PAGADO"]
[27," ISAAC ESPINOSA","BAEKJUL AYALA","OYENTE",0,{"v":15,"d":"$15.00"},"PAGADO"]
[28,"FREDDY FERNANDEZ","BAEKJUL FERNANDEZ","DIRECTOR CLUB FILIAL",0,{"v":15,"d":"$15.00"},"PAGADO"]
[29,"BETTY BASTIDAS","BASPANTHERS","ENTRENADOR CLUB FILIAL",{"v":15,"d":"$15.00"},0,"PAGADO"]
[31,"PAULETTE OSCULLO","BASPANTHERS","MONITOR CLUB FILIAL",{"v":15,"d":"$15.00"},0,"PAGADO"]
[32," ZULAY OSCULLO","BASPANTHERS","MONITOR CLUB FILIAL",{"v":15,"d":"$15.00"},0,"PAGADO"]
[33,"WILIAN SUAREZ","BASPANTHERS","MONITOR CLUB FILIAL",0,{"v":15,"d":"$15.00"},"PAGADO"]
[34,"SALOME SALGADO","BASPANTHERS","OYENTE",{"v":15,"d":"$15.00"},0,"PAGADO"]
[36," WILLIAM SUNTAXI","BLUE DRAGONS","DIRECTOR CLUB FILIAL",0,{"v":15,"d":"$15.00"},"PAGADO"]
[37,"STALIN SUNTAXI","BLUE DRAGONS","ENTRENADOR CLUB FILIAL",0,{"v":15,"d":"$15.00"},"PAGADO"]
[38,"ANTHONELLA GARCIA","BLUE DRAGONS","DEPORTISTA AVANZADO",0,{"v":15,"d":"$15.00"},"PAGADO"]
[39,"MARÍA GRACIA PALTAN","BLUE DRAGONS","MONITOR CLUB FILIAL",0,{"v":15,"d":"$15.00"},"PAGADO"]
[40,"EMILIA PALTAN","BLUE DRAGONS","MONITOR CLUB FILIAL",0,{"v":15,"d":"$15.00"},"PAGADO"]
[41,"JULIAN PANTOJA","BLUE DRAGONS","MONITOR CLUB FILIAL",0,{"v":15,"d":"$15.00"},"PAGADO"]
[42,"NATALIA TUFIÑO","BLUE DRAGONS","ENTRENADOR CLUB FILIAL",0,{"v":15,"d":"$15.00"},"PAGADO"]
[43,"KENNY PILACUAN","BLUE DRAGONS","MONITOR CLUB FILIAL",0,{"v":15,"d":"$15.00"},"PAGADO"]
[44,"AMY PARRA","BLUE DRAGONS","OYENTE",0,{"v":15,"d":"$15.00"},"PAGADO"]
[45,"MARÍA NARANJO","BORJAS LION","MONITOR CLUB FILIAL",0,{"v":15,"d":"$15.00"},"PAGADO"]
[46,"BYRON BERRONES","CHAMPIONS FOR LIFE","DIRECTOR CLUB FILIAL",0,{"v":15,"d":"$15.00"},"PAGADO"]
[47,"JOHN QUEZADA","CHAMPIONS FOR LIFE","ENTRENADOR CLUB FILIAL",0,{"v":15,"d":"$15.00"},"PAGADO"]
[48,"DANIEL LAZO","CHAMPIONS FOR LIFE","ENTRENADOR CLUB FILIAL",0,{"v":15,"d":"$15.00"},"PAGADO"]
[49,"CARLOS MOROCHO","CHUNG SUNG","ARBITRO",0,{"v":15,"d":"$15.00"},"PAGADO"]
[50,"SCARLET MANZANO","CHUNG SUNG","ARBITRO",0,{"v":15,"d":"$15.00"},"PAGADO"]
[51,"JOHANNA MOROCHO","CHUNG SUNG","ENTRENADOR CLUB FILIAL",{"v":15,"d":"$15.00"},0,"PAGADO"]
[52,"ARIANNA SINCHE","CHUNG SUNG","DEPORTISTA AVANZADO",{"v":15,"d":"$15.00"},0,"PAGADO"]
[53,"PAULA SANTILLAN","CHUNG SUNG","DEPORTISTA AVANZADO",0,{"v":15,"d":"$15.00"},"PAGADO"]
[54,"ADRIANA OBANDO","CIUDAD DE QUITO","ENTRENADOR CLUB FILIAL",0,{"v":15,"d":"$15.00"},"PAGADO"]
[55,"DEREK LARCO","CIUDAD DE QUITO","ENTRENADOR CLUB FILIAL",0,{"v":15,"d":"$15.00"},"PAGADO"]
[56,"WILSON RODRIGUEZ","CLUB YONG TIGER","DIRECTOR CLUB FILIAL",0,0,"EXONERADO"]
[57," ZULAY OSCULLO","HAN KUM DO","ARBITRO",{"v":15,"d":"$15.00"},0,"PAGADO"]
[58,"KARENT TAPIA","HAN KUM DO","ARBITRO",{"v":15,"d":"$15.00"},0,"PAGADO"]
[59,"DANNA ACOSTA","JOSEON LEGACY","ARBITRO",0,{"v":15,"d":"$15.00"},"PAGADO"]
[60,"LUIS CUJILEMA","JOSEON LEGACY","ARBITRO",0,{"v":15,"d":"$15.00"},"PAGADO"]
[61,"VLADIMIR VIANA","JOSEON LEGACY","ARBITRO",0,{"v":15,"d":"$15.00"},"PAGADO"]
[62,"ELLIOTH FREIRE","JOSEON LEGACY","ARBITRO",0,0,"PENDIENTE"]
[63,"ANTHONY CASTRO","JOSEON LEGACY","ARBITRO",{"v":15,"d":"$15.00"},0,"PAGADO"]
[64,"CARLOS MOYA","JOSEON LEGACY","DIRECTOR CLUB FILIAL",0,0,"EXONERADO"]
[65,"PATRICIA TUQUERES","CLUB TAE WOONG","ARBITRO",0,0,"EXONERADA"]
[66,"MICHELLE CALUGUILLIN","CLUB TAE WOONG","ARBITRO",{"v":15,"d":"$15.00"},0,"PAGADO"]
[67,"JIMMY BOLAÑOS","DEBAK TKD","DIRECTOR CLUB FILIAL",0,0,"EXONERADO"]
[68,"JOAQUIN VARGAS","DEBAK TKD","ENTRENADOR CLUB FILIAL",0,{"v":15,"d":"$15.00"},"PAGADO"]
[69,"JARED VARGAS","DEBAK TKD","ENTRENADOR CLUB FILIAL",0,{"v":15,"d":"$15.00"},"PAGADO"]
[70,"ADRIAN LARA","DEBAK TKD","ENTRENADOR CLUB FILIAL",0,{"v":15,"d":"$15.00"},"PAGADO"]
[71,"SANTIAGO LLAGUNO","DEBAK TKD","ENTRENADOR CLUB FILIAL",0,{"v":15,"d":"$15.00"},"PAGADO"]
[72,"JOSÉ ALEJO","DEBAK TKD","MONITOR CLUB FILIAL",0,{"v":15,"d":"$15.00"},"PAGADO"]
[73,"BOLIVAR MELO","DOYANG TKD MELO","DIRECTOR CLUB FILIAL",0,{"v":15,"d":"$15.00"},"PAGADO"]
[74,"JORGE ASTUDILLO","ECUADOR","ENTRENADOR CLUB FILIAL",0,{"v":15,"d":"$15.00"},"PAGADO"]
[75,"EDWIN VALDIVIESO","ECUADOR","MONITOR CLUB FILIAL",0,{"v":15,"d":"$15.00"},"PAGADO"]
[76,"1712775780 - LUIS LARA","ECUADOR","MONITOR CLUB FILIAL",0,{"v":15,"d":"$15.00"},"PAGADO"]
[77,"JHONATAN LARA","ECUADOR","DEPORTISTA AVANZADO",0,{"v":15,"d":"$15.00"},"PAGADO"]
[78,"ROBERTA ZARUMEÑO","ECUADOR","DEPORTISTA AVANZADO",0,{"v":15,"d":"$15.00"},"PAGADO"]
[79,"RAPHAELLA ZARUMEÑO","ECUADOR","DEPORTISTA AVANZADO",0,{"v":15,"d":"$15.00"},"PAGADO"]
[80,"STEPHANY ARMIJOS","ECUADOR","DEPORTISTA AVANZADO",0,{"v":15,"d":"$15.00"},"PAGADO"]
[81,"LUIS PEÑALOZA","ECUADOR","MONITOR CLUB FILIAL",0,{"v":15,"d":"$15.00"},"PAGADO"]
[82,"EMILIA PEÑALOZA","ECUADOR","MONITOR CLUB FILIAL",0,{"v":15,"d":"$15.00"},"PAGADO"]
[83,"DAYANA ZAPATA","ECUADOR","DEPORTISTA AVANZADO",0,{"v":15,"d":"$15.00"},"PAGADO"]
[84,"MARLON QUIJIJE","ECUADOR","MONITOR CLUB FILIAL",0,{"v":15,"d":"$15.00"},"PAGADO"]
[85,"JUAN VALENCIA","EQUILIBRIO","DIRECTOR CLUB FILIAL",{"v":15,"d":"$15.00"},0,"PAGADO"]
[86,"EDUARDO LOACHAMIN","ESPE","DIRECTOR CLUB FILIAL",0,{"v":15,"d":"$15.00"},"PAGADO"]
[87," ANGELA NASAMUES","ESPE","ARBITRO",{"v":15,"d":"$15.00"},0,"PAGADO"]
[88,"JOSELYN YANCHAPAXI","ESPE","ENTRENADOR CLUB FILIAL",0,{"v":15,"d":"$15.00"},"PAGADO"]
[89,"JOSUE ROJAS","FARANG","ARBITRO",{"v":15,"d":"$15.00"},0,"PAGADO"]
[90,"ANDREA ZULETA","FIRST CLASS CALDERON","MONITOR CLUB FILIAL",0,{"v":15,"d":"$15.00"},"PAGADO"]
[91,"FRANKLIN CAIZA","FURIA NEGRA","DIRECTOR CLUB FILIAL",0,{"v":15,"d":"$15.00"},"PAGADO"]
[92,"ESLENDY CAIZA","FURIA NEGRA","ENTRENADOR CLUB FILIAL",0,{"v":15,"d":"$15.00"},"PAGADO"]
[93,"CRISTIAN PERDOMO","FURIA NEGRA","ENTRENADOR CLUB FILIAL",0,{"v":15,"d":"$15.00"},"PAGADO"]
[94,"SHEILA VALLADARES","HANSU CAYAMBE","ENTRENADOR CLUB FILIAL",{"v":15,"d":"$15.00"},0,"PAGADO"]
[95,"GALO VALLADARES","HANSU CAYAMBE","DIRECTOR CLUB FILIAL",0,0,"EXONERADO"]
[96,"MIGUEL PARRA","ILYO MP","DIRECTOR CLUB FILIAL",0,{"v":15,"d":"$15.00"},"PAGADO"]
[97,"MATEO PARRA","ILYO MP","MONITOR CLUB FILIAL",0,{"v":15,"d":"$15.00"},"PAGADO"]
[98,"EMPERATRIZ QUINGA","JITAE","DIRECTOR CLUB FILIAL",0,{"v":15,"d":"$15.00"},"PAGADO"]
[99,"ALEXANDER DUCHI","JITAE","DEPORTISTA AVANZADO",0,{"v":15,"d":"$15.00"},"PAGADO"]
[100,"DAVID DELCASTILLO","JIDOKWAN DC","ARBITRO",0,{"v":15,"d":"$15.00"},"PAGADO"]
[101,"ANGELO CORDERO","KO AMERICA","ARBITRO",0,{"v":15,"d":"$15.00"},"PAGADO"]
[102,"JENNY LUNA","LEON","ARBITRO",{"v":15,"d":"$15.00"},0,"PAGADO"]
[104,"INELIA PILAQUINGA","LEON","ENTRENADOR CLUB FILIAL",{"v":15,"d":"$15.00"},0,"PAGADO"]
[105,"JOSE CHAURAN","LEON","OYENTE",0,{"v":15,"d":"$15.00"},"PAGADO"]
[106,"NORMA ORTIZ","LITHE BODY","DIRECTOR CLUB FILIAL",0,{"v":15,"d":"$15.00"},"PAGADO"]
[107,"FERNANDO INDA","LITHE BODY","ENTRENADOR CLUB FILIAL",0,{"v":15,"d":"$15.00"},"PAGADO"]
[108,"ERIK ENRIQUEZ","LITHE BODY","DEPORTISTA AVANZADO",0,{"v":15,"d":"$15.00"},"PAGADO"]
[110,"ANDRES HERRERA","PANDADEMON","DIRECTOR CLUB FILIAL",{"v":15,"d":"$15.00"},0,"PAGADO"]
[111,"HUGO SIGCHOS","PYONGYANG","ARBITRO",0,{"v":15,"d":"$15.00"},"PAGADO"]
[112,"JOE GAVILANEZ","PUMAS","ENTRENADOR CLUB FILIAL",0,{"v":15,"d":"$15.00"},"PAGADO"]
[113,"GALO GAVILANEZ","PUMAS","DIRECTOR CLUB FILIAL",0,{"v":15,"d":"$15.00"},"PAGADO"]
[114,"GUSTAVO SUNTAXI","PUMAS","ARBITRO",{"v":15,"d":"$15.00"},0,"PAGADO"]
[115,"LORENA SUNTAXI","PUMAS","ENTRENADOR CLUB FILIAL",0,{"v":15,"d":"$15.00"},"PAGADO"]
[116,"LUIS GRANDA","MARCIAL CLUB GRANDA","DIRECTOR CLUB FILIAL",0,{"v":15,"d":"$15.00"},"PAGADO"]
[117,"ERICK GRANDA","MARCIAL CLUB GRANDA","DEPORTISTA AVANZADO",0,{"v":15,"d":"$15.00"},"PAGADO"]
[118,"WELLINGTON SANCHEZ","MICHAY DO","DIRECTOR CLUB FILIAL",0,{"v":15,"d":"$15.00"},"PAGADO"]
[120,"JORGE ROJAS","PVM","DIRECTOR CLUB FILIAL",{"v":15,"d":"$15.00"},0,"PAGADO"]
[121,"MILTON RAMOS","RENACER","ARBITRO",0,{"v":15,"d":"$15.00"},"PAGADO"]
[122,"ANDY COLUMBA","SAN SEBASTIAN","ENTRENADOR CLUB FILIAL",{"v":15,"d":"$15.00"},0,"PAGADO"]
[124,"RAUL TIPAN","SAN SEBASTIAN","DIRECTOR CLUB FILIAL",0,{"v":15,"d":"$15.00"},"PAGADO"]
[125,"CARLOS MEJIA","SAN FRANCISCO TIGRES","DIRECTOR CLUB FILIAL",0,0,"EXONERADO"]
[126,"GALO GARZON","SEUL","DIRECTOR CLUB FILIAL",0,0,"EXONERADO"]
[128,"JOSÉ PALACIOS","SEUL","ENTRENADOR CLUB FILIAL",{"v":15,"d":"$15.00"},0,"PAGADO"]
[129,"VICTOR GARZON","SEUL","ARBITRO",0,{"v":15,"d":"$15.00"},"PAGADO"]
[130,"JOSE MIZQUERO","SEUL","ENTRENADOR CLUB FILIAL",{"v":15,"d":"$15.00"},0,"PAGADO"]
[131,"MARCO RIVERA","SEUL","ARBITRO",{"v":15,"d":"$15.00"},0,"PAGADO"]
[132,"DANNY YEROVI","SEUL","DEPORTISTA AVANZADO",{"v":15,"d":"$15.00"},0,"PAGADO"]
[133,"CARLOS MOLINA","SEUL","ENTRENADOR CLUB FILIAL",{"v":15,"d":"$15.00"},0,"PAGADO"]
[134,"ARELIZ MAYORGA","SEUL","ARBITRO",0,{"v":15,"d":"$15.00"},"PAGADO"]
[135,"MAYRA MANOTO","SEUL","DEPORTISTA AVANZADO",{"v":15,"d":"$15.00"},0,"PAGADO"]
[136,"MARISOL REATEGUI","SEUL","MONITOR CLUB FILIAL",{"v":15,"d":"$15.00"},0,"PAGADO"]
[137,"MARCO MOGOLLÓN","SIMJANG TEAM","DIRECTOR CLUB FILIAL",0,{"v":15,"d":"$15.00"},"PAGADO"]
[138,"KERLY QUINTANA","SIMJANG TEAM","MONITOR CLUB FILIAL",0,{"v":15,"d":"$15.00"},"PAGADO"]
[139,"MARIUXI NIETO","SIMJANG TEAM","MONITOR CLUB FILIAL",0,{"v":15,"d":"$15.00"},"PAGADO"]
[140,"JOSE MORAN","SDC","ENTRENADOR CLUB FILIAL",{"v":15,"d":"$15.00"},0,"PAGADO"]
[141,"JHONNY SUNTAXI","SDC","MONITOR CLUB FILIAL",0,{"v":15,"d":"$15.00"},"PAGADO"]
[142,"JULIO ALVAREZ","SDC","MONITOR CLUB FILIAL",{"v":15,"d":"$15.00"},0,"PAGADO"]
[143,"CARLOR REINOSO","SDC","DIRECTOR CLUB FILIAL",{"v":15,"d":"$15.00"},0,"PAGADO"]
[144,"ANDRES REINOSO","SDC","ENTRENADOR CLUB FILIAL",{"v":15,"d":"$15.00"},0,"PAGADO"]
[145,"KEYNA TONATO","SDC","MONITOR CLUB FILIAL",{"v":15,"d":"$15.00"},0,"PAGADO"]
[146,"CAMILA MARTINEZ","SDC","ENTRENADOR CLUB FILIAL",{"v":15,"d":"$15.00"},0,"PAGADO"]
[147,"MATHEU TULCAN","SDC","ARBITRO",0,{"v":15,"d":"$15.00"},"PAGADO"]
[148,"JOSET PEREZ","SDC","ARBITRO",0,{"v":15,"d":"$15.00"},"PAGADO"]
[149,"ISABELLA BARRAZUETA","SDC","MONITOR CLUB FILIAL",{"v":15,"d":"$15.00"},0,"PAGADO"]
[150,"JONATHAN PAZPUR","SDC","DEPORTISTA AVANZADO",0,{"v":15,"d":"$15.00"},"PAGADO"]
[151,"JEAN ARTEAGA","TAE BAEK","ENTRENADOR CLUB FILIAL",0,{"v":15,"d":"$15.00"},"PAGADO"]
[152,"EDWIN ARTEAGA","TAE BAEK","DIRECTOR CLUB FILIAL",0,{"v":15,"d":"$15.00"},"PAGADO"]
[153,"VANESSA SIERRA","TAE BAEK","ENTRENADOR CLUB FILIAL",0,{"v":15,"d":"$15.00"},"PAGADO"]
[154,"NICOLAS GUALACATA","TAEDO","MONITOR CLUB FILIAL",0,{"v":15,"d":"$15.00"},"PAGADO"]
[155,"EDWIN MONTENEGRO","TAE SHO KU","MONITOR CLUB FILIAL",0,{"v":15,"d":"$15.00"},"PAGADO"]
[156,"JHON TAPIA","TAE SHO KU","MONITOR CLUB FILIAL",0,{"v":15,"d":"$15.00"},"PAGADO"]
[157,"JOEL CUNALATA","TAE SHO KU","MONITOR CLUB FILIAL",{"v":15,"d":"$15.00"},0,"PAGADO"]
[158,"EDWIN OCHOA","TAE SHO KU","DIRECTOR CLUB FILIAL",0,{"v":15,"d":"$15.00"},"PAGADO"]
[159,"JUAN VERDEZOTO","TAE SHO KU","MONITOR CLUB FILIAL",{"v":15,"d":"$15.00"},0,"PAGADO"]
[160,"GISSELL ESTRELLA","TAE SHO KU","ARBITRO",0,{"v":15,"d":"$15.00"},"PAGADO"]
[161,"ARIANNA ARIAS","TAE SHO KU","DEPORTISTA AVANZADO",0,{"v":15,"d":"$15.00"},"PAGADO"]
[162,"ANAHI ARIAS","TAE SHO KU","DEPORTISTA AVANZADO",0,{"v":15,"d":"$15.00"},"PAGADO"]
[163,"SHIRLEY SIGCHA","TAE SHO KU","ARBITRO",0,{"v":15,"d":"$15.00"},"PAGADO"]
[164,"JUAN LOYA","TAE SHO KU","ENTRENADOR CLUB FILIAL",0,{"v":15,"d":"$15.00"},"PAGADO"]
[165,"CAMILA CHAMBA","TAE SHO KU","DEPORTISTA AVANZADO",0,{"v":15,"d":"$15.00"},"PAGADO"]
[166,"DANILO PEREZ","TAEGUK JUCARO","DIRECTOR CLUB FILIAL",{"v":15,"d":"$15.00"},0,"PAGADO"]
[167,"BRITANI PEREZ","TAEGUK JUCARO","ENTRENADOR CLUB FILIAL",{"v":15,"d":"$15.00"},0,"PAGADO"]
[168,"RAÚL AUCANCELA","TOTAL KOMBAT","DIRECTOR CLUB FILIAL",0,{"v":15,"d":"$15.00"},"PAGADO"]
[169,"SANDRA CONGO","TOTAL KOMBAT","ENTRENADOR CLUB FILIAL",0,{"v":15,"d":"$15.00"},"PAGADO"]
[170,"DAYANA VALDIVIESO","TOTAL KOMBAT","MONITOR CLUB FILIAL",0,{"v":15,"d":"$15.00"},"PAGADO"]
[171,"CARLOS CAIZA","TOTAL KOMBAT","ENTRENADOR CLUB FILIAL",{"v":15,"d":"$15.00"},0,"PAGADO"]
[172,"BRYAN PAREDES","TOTAL KOMBAT","ENTRENADOR CLUB FILIAL",{"v":15,"d":"$15.00"},0,"PAGADO"]
[173,"GUSTAVO LLAMUCA","TOTAL KOMBAT","ENTRENADOR CLUB FILIAL",0,{"v":15,"d":"$15.00"},"PAGADO"]
[174,"JAVIER TASIGUANO","TOTAL KOMBAT","MONITOR CLUB FILIAL",{"v":15,"d":"$15.00"},0,"PAGADO"]
[175,"BRYAN ENRIQUEZ","MARCIAL GRANDA","ENTRENADOR CLUB FILIAL",0,{"v":15,"d":"$15.00"},"PAGADO"]
[176,"JENNY BARROS","KUNGANDUK","ENTRENADOR CLUB FILIAL",{"v":15,"d":"$15.00"},0,"PAGADO"]
[177,"SHARON LOPEZ","KORYO","ENTRENADOR CLUB FILIAL",0,{"v":15,"d":"$15.00"},"PAGADO"]
[178,"GUILLERMO PUGA","KORYO","DIRECTOR CLUB FILIAL",0,{"v":15,"d":"$15.00"},"PAGADO"]
[179,"DENISSE PACHACAMA","KORYO","DEPORTISTA AVANZADO",0,{"v":15,"d":"$15.00"},"PAGADO"]
[180,"NICOL BALSECA","TEEN VENCEDORES","MONITOR CLUB FILIAL",0,{"v":15,"d":"$15.00"},"PAGADO"]
[181,"DOMINIC GRANDA","TEEN VENCEDORES","MONITOR CLUB FILIAL",0,{"v":15,"d":"$15.00"},"PAGADO"]
[182,"CARLOS GONZÑALEZ","TEEN VENCEDORES","MONITOR CLUB FILIAL",0,{"v":15,"d":"$15.00"},"PAGADO"]
[183,"CECILIA CASTILLO","TEEN VENCEDORES","ENTRENADOR CLUB FILIAL",0,{"v":15,"d":"$15.00"},"PAGADO"]
[184,"MARLON LEMA","MASTER HOME","DIRECTOR CLUB FILIAL",0,{"v":15,"d":"$15.00"},"PAGADO"]
[185,"JORGE NARANJO","MASTER HOME","ENTRENADOR CLUB FILIAL",0,{"v":15,"d":"$15.00"},"PAGADO"]
[186,"DANILO NARANJO","MASTER HOME","ENTRENADOR CLUB FILIAL",{"v":15,"d":"$15.00"},0,"PAGADO"]
[187,"DARIO SUNTAXI","MASTER HOME","MONITOR CLUB FILIAL",0,{"v":15,"d":"$15.00"},"PAGADO"]
[188,"GUSTAVO  QUISHPE","APOLO","MONITOR CLUB FILIAL",{"v":7.5,"d":"$7.50"},0,"PAGADO"]
[189,"KEVIN ZAPATA","ILYO MP","ENTRENADOR CLUB FILIAL",0,{"v":15,"d":"$15.00"},"PAGADO"]
[190,"EDGAR VASCONEZ","APOLO","MONITOR CLUB FILIAL",0,{"v":15,"d":"$15.00"},"PAGADO"]
[191,"DANIL FLORES","HANSU CAYAMBE","ENTRENADOR CLUB FILIAL",{"v":15,"d":"$15.00"},0,"PAGADO"]
[192,"FABIAN ROMAN","JUVENTUS","ARBITRO",0,{"v":15,"d":"$15.00"},"PAGADO"]
[193,"DIEGO MORILLO","JUVENTUS","ARBITRO",0,{"v":15,"d":"$15.00"},"PAGADO"]
["TOTAL",{"$nulls":3},{"$f":"SUM(E6:E191)","v":{"v":892.5,"d":"$892.50"}},{"$f":"SUM(F6:F191)","v":{"v":1725,"d":"$1,725.00"}},{"$f":"SUM(E192:F192)","v":{"v":2617.5,"d":"$2,617.50"}}]
[]
[]
[null,"INGRESOS"]
[null,"INSCRIPCIONES EFECTIVO",{"$f":"E192","v":{"v":892.5,"d":"$ 892.50"}}]
[null,"INSCRIPCIONES TRANSFERENCIA",{"$f":"F192","v":{"v":1725,"d":"$ 1,725.00"}}]
[null,"TOTAL",{"$f":"SUM(C196:C197)","v":{"v":2617.5,"d":"$ 2,617.50"}}]
[]
[]
[null,"EGRESOS"]
[null,"ALIMENTACIÓN STAFF 18-07-2025",{"v":23,"d":"$ 23.00"}]
[null,"IMPRESIÓN DE CERTIFICADOS Y MOVILIZACIÓN",{"v":68,"d":"$ 68.00"}]
[null,"SOBRES MANILA PARA CERTIFICADOS",{"v":10.5,"d":"$ 10.50"}]
[null,"PRODUCTOS DE CAFETERÍA PARA EVENTO",{"v":36.44,"d":"$ 36.44"}]
[null,"PAGO EXPOSITORES",{"v":300,"d":"$ 300.00"}]
[null,"ALIMENTACIÓN STAFF 19-07-2025",{"v":49.5,"d":"$ 49.50"}]
[null,"CERTIFICADOS (PARTE II) Y MOVILIZACIÓN",{"v":22,"d":"$ 22.00"}]
[null,"DIFUSIÓN Y COBERTURA DURANTE EL EVENTO",{"v":25,"d":"$ 25.00"}]
[null,"REALIZACIÓN DE CERTIFICADOS FALTANTES",{"v":30,"d":"$ 30.00"}]
[null,"PAGO STAFF",{"v":200,"d":"$ 200.00"}]
[null,"ORGANIZACIÓN Y DIRECCIÓN DEL EVENTO",{"v":110,"d":"$ 110.00"}]
[null,"ORNAMENTA Y ADECUACIONES DE ESCENARIO",{"v":116.2,"d":"$ 116.20"}]
[null,"TOTAL",{"$f":"SUM(C202:C213)","v":{"v":990.6400000000001,"d":"$ 990.64"}}]
[]
[]
[null,"INGRESOS",{"$f":"C198","v":{"v":2617.5,"d":"$ 2,617.50"}}]
[null,"EGRESOS",{"$f":"-C214","v":{"v":-990.6400000000001,"d":"$ (990.64)"}}]
[null,"SALDO",{"$f":"C217+C218","v":{"v":1626.86,"d":"$ 1,626.86"}}]
[]
[]
[null,"POR COBRAR"]
[null,"CLUB","VALOR"]
[null,"ASO. TKDP (CARLOS MAGALLANES)",{"v":15,"d":"$ 15.00"}]
[null,"ATLAS CLUB (KEVIN ROSADO)",{"v":15,"d":"$ 15.00"}]
[null,"JOSEON LEGACY (ELLIOTH FREIRE)",{"v":15,"d":"$ 15.00"}]
[null,"TOTAL",{"$f":"SUBTOTAL(9,C224:C226)","v":{"v":45,"d":"$ 45.00"}}]

{"sheet":"HANMADANG - OPEN CLASIFICADOS","index":10,"n_rows":52,"n_cols":10,"rows_kept":52,"merged":[[0,0,0,9],[1,0,1,9],[2,0,2,9],[3,0,3,9],[18,0,18,2],[21,1,21,2],[28,1,28,2]]}
["ASOCIACIÓN DE TAEKWONDO DE PICHINCHA"]
["TORNEO HANMADANG -  OPEN CLASIFICADOS"]
["COLISEO \"LOS QUITUS\" 9-08-2025"]
[]
["Nº","CLUB","SIGLAS","HANMADANG","OPEN CLASIFICADOS","ENTRENADOR","CAMBIO DE CATEGORÍA","PAGO EFECT.","PAGO TRANSF.","TOTAL"]
[1,"ARES ","ARE",6,"-",2,"-",0,{"v":100,"d":"$100.00"},"PAGADO"]
[2,"DEBAK TKD","DBK",1,"-","-","-",{"v":16,"d":"$16.00"},0,"PAGADO"]
[3,"DRAGON GYM","DRG",6,"-",2,"-",{"v":40,"d":"$40.00"},{"v":60,"d":"$60.00"},"PAGADO"]
[4,"ESPE","ESP",4,1,1,"-",0,{"v":82,"d":"$82.00"},"PAGADO"]
[5,"LOS PUMAS ","PUM",8,4,2,"-",0,{"v":196,"d":"$196.00"},"PAGADO"]
[6,"SEUL","SEU",1,1,"-","-",{"v":22,"d":"$22.00"},{"v":10,"d":"$10.00"},"PAGADO"]
[7,"S.D.CENTRAL ","SDC",13,12,2,"-",{"v":30,"d":"$30.00"},{"v":374,"d":"$374.00"},"PAGADO"]
[8,"TOTAL KOMBAT","TKT",1,"-",1,"-",0,{"v":18,"d":"$18.00"},"PAGADO"]
[9,"BAEKJUL TKD","BJK",0,9,3,1,{"v":155,"d":"$155.00"},0,"PAGADO"]
[10,"BLUE DRAGONS","BDR",0,1,1,"-",0,{"v":18,"d":"$18.00"},"PAGADO"]
[11,"BORJA'S LIONS","BLS",0,3,2,"-",{"v":52,"d":"$52.00"},0,"PAGADO"]
[12,"JERATHEL","JER",0,2,2,"-",{"v":36,"d":"$36.00"},0,"PAGADO"]
[13,"KO AMERICA","KOA",0,1,"-","-",{"v":16,"d":"$16.00"},0,"PAGADO"]
["TOTAL",null,null,40,{"$f":"SUM(E6:E18)","v":34},{"$f":"SUM(F6:F18)","v":18},{"$f":"SUM(G6:G18)","v":1},{"$f":"SUM(H6:H18)","v":{"v":367,"d":"$367.00"}},{"$f":"SUM(I6:I18)","v":{"v":858,"d":"$858.00"}},{"$f":"SUM(H19:I19)","v":{"v":1225,"d":"$1,225.00"}}]
[]
[]
[null,"INGRESOS"]
[null,"INSCRIPCIONES EFECTIVO",{"$f":"H19","v":{"v":367,"d":"$ 367.00"}}]
[null,"INSCRIPCIONES TRANSFERENCIA",{"$f":"I19","v":{"v":858,"d":"$ 858.00"}}]
[null,"TAQUILLA",{"v":105,"d":"$ 105.00"}]
[null,"TOTAL",{"$f":"SUM(C23:C25)","v":{"v":1330,"d":"$ 1,330.00"}}]
[]
[]
[null,"EGRESOS"]
[null,"TABLAS DE ROMPIMIENTOS (100)",{"v":50,"d":"$ 50.00"}]
[null,"ARREGLOS FLORALES (2)",{"v":32,"d":"$ 32.00"}]
[null,"BLOQUES Y LABRILLOS ",{"v":19.65,"d":"$ 19.65"}]
[null,"TROFEOS (6) - MEDALLAS (89)",{"v":306.8,"d":"$ 306.80"}]
[null,"PAGO ARBITRAJE ",{"v":305,"d":"$ 305.00"}]
[null,"PAGO MONTAJE Y DESMONTAJE DE ESCENARIO",{"v":50,"d":"$ 50.00"}]
[null,"PAGO STAFF (5 PERSONAS)",{"v":100,"d":"$ 100.00"}]
[null,"ALIMENTACIÓN STAFF (ÁRBITROS Y PERSONAL DE APOYO)",{"v":80,"d":"$ 80.00"}]
[null,"REFRIGERIO",{"v":7.5,"d":"$ 7.50"}]
[null,"LIMPIEZA ",{"v":20,"d":"$ 20.00"}]
[null,"DIFUSIÓN Y COBERTURA DURANTE EL EVENTO",{"v":20,"d":"$ 20.00"}]
[null,"ORGANIZACIÓN Y DIRECCIÓN DEL EVENTO",{"v":60,"d":"$ 60.00"}]
[null,"TRANSPORTE (MEDALLAS Y TROFEOS)",{"v":12,"d":"$ 12.00"}]
[null,"PRODUCTOS DE ASEO Y LIMPIEZA ",{"v":4.5,"d":"$ 4.50"}]
[null,"MEDICAMENTOS",{"v":23.5,"d":"$ 23.50"}]
[null,"ELABORACIÓN DE LLAVES Y DÍA DE TRABAJO FERNANDO MOYA ",{"v":40,"d":"$ 40.00"}]
[null,"PERSONAL MÉDICO (1 PERSONA)",{"v":20,"d":"$ 20.00"}]
[null,"TOTAL",{"$f":"SUM(C30:C46)","v":{"v":1150.95,"d":"$ 1,150.95"}}]
[]
[]
[null,"INGRESOS",{"$f":"C26","v":{"v":1330,"d":"$ 1,330.00"}}]
[null,"EGRESOS",{"$f":"-C47","v":{"v":-1150.95,"d":"$ (1,150.95)"}}]
[null,"SALDO",{"$f":"C50+C51","v":{"v":179.04999999999995,"d":"$ 179.05"}}]

{"sheet":"EGRESOS","index":11,"n_rows":323,"n_cols":7,"rows_kept":323,"merged":[[1,0,2,3]]}
[]
["EGRESOS",{"$nulls":5},"TOTAL"]
[{"$nulls":6},{"$f":"SUM(F6:F318)","v":{"v":30176.260000000002,"d":"$ 30,176.26"}}]
[]
[{"$nulls":5},"SUBTOTAL"]
["FECHA","OFICINA Y TECNOLOGÍA","DETALLE","VALOR",null,{"$f":"SUM(D7:D36)","v":{"v":339,"d":"$ 339.00"}}]
["2025-03-20",null,"COMPRA DE RESALTADOR",{"v":0.75,"d":"$ 0.75"}]
["2025-03-21",null,"COMPRA DE 20 CARTULINAS BLANCAS (VOCATIVOS PARA EVENTOS Y CEREMONIAS ASOTKD-P)",{"v":1,"d":"$ 1.00"}]
["2025-03-23",null,"COMPRA DE GRAPADORA",{"v":3.5,"d":"$ 3.50"}]
["2025-03-26",null,"COMPRA DE RESMA DE PAPEL",{"v":5,"d":"$ 5.00"}]
["2025-03-26",null,"COMPRA DE ARCHIVADOR (ENTREGA DE INFORME ECONÓMICO PRESIDENCIA CDP)",{"v":3.5,"d":"$ 3.50"}]
["2025-03-26",null,"COMPRA DE 10 CARTULINAS BLANCAS (VOCATIVOS PARA EVENTOS Y CEREMONIAS ASOTKD-P)",{"v":0.5,"d":"$ 0.50"}]
["2025-03-31",null,"COMPRA DE MASKING Y CINTA ADHESIVA TRANSPARENTE",{"v":3.6,"d":"$ 3.60"}]
["2025-04-04",null,"COMPRA DE RESMA DE PAPEL",{"v":4,"d":"$ 4.00"}]
["2025-04-08",null,"COMPRA DE ARTÍCULOS VARIOS (ACETONA, ALGODÓN Y GUANTES)",{"v":5.7,"d":"$ 5.70"}]
["2025-04-08",null,"COMPRA DE CUADERNO DE NOTA TIPO AGENDA PARA SECRETARÍA ",{"v":2.25,"d":"$ 2.25"}]
["2025-04-10",null,"COMPRA DE 20 CARTULINAS BLANCAS (VOCATIVOS PARA EVENTOS Y CEREMONIAS ASOTKD-P)",{"v":1,"d":"$ 1.00"}]
["2025-04-14",null,"CARPETAS DE CARTÓN",{"v":3,"d":"$ 3.00"}]
["2025-04-19",null,"COMPRA DE RESMA DE PAPEL Y GLOBOS (PARA FESTIVALES INFANTILES)",{"v":8,"d":"$ 8.00"}]
["2025-04-28",null,"COMPRA DE PILAS PARA CONTROLES DE TV ASOTKDP",{"v":2,"d":"$ 2.00"}]
["2025-05-03",null,"COMPRA DE CINTA ADHESIVA ",{"v":3,"d":"$ 3.00"}]
["2025-05-12",null,"COMPRA DE CAJAS ESFEROS",{"v":8.5,"d":"$ 8.50"}]
["2025-05-13",null,"IMPRESIÓN DE VOCATIVOS EN CARTULINAS A4 (COLABORACIÓN LANZAMIENTO DEL LIBRO ESTALIN VILLARROEL)",{"v":5.35,"d":"$ 5.35"}]
["2025-05-15",null,"COMPRA DE CARTULINAS",{"v":0.75,"d":"$ 0.75"}]
["2025-05-16",null,"COMPRA DE CINTA ADHESIVA (X2)",{"v":3.6,"d":"$ 3.60"}]
["2025-05-17",null,"COMPRA DE RESMA DE PAPEL ",{"v":4,"d":"$ 4.00"}]
["2025-05-19",null,"COMPRA DE MASKING",{"v":3,"d":"$ 3.00"}]
["2025-06-12",null,"COMPRA DE PAQUETE DE CARTULINAS BLANCAS",{"v":2.81,"d":"$ 2.81"}]
["2025-06-12",null,"COMPRA DE PORTACREDENCIAL VERTICAL GRADE DE PLÁSTICO (100 UNIDADES)",{"v":22.49,"d":"$ 22.49"}]
["2025-06-13",null,"COMPRA DE CARTULINAS BLANCAS",{"v":1,"d":"$ 1.00"}]
["2025-07-04",null,"COMPRA DE MARCADOR PERMANENTE PUNTA FINA",{"v":1.15,"d":"$ 1.15"}]
["2025-07-07",null,"COMPRA DE RESMA DE PAPEL",{"v":4,"d":"$ 4.00"}]
["2025-08-08",null,"COMPRA DE CINTA DE EMBALAJE (X2)",{"v":3,"d":"$ 3.00"}]
["2025-08-21",null,"REPARACIÓN IMPRESORA EPSON DE OFICINA ASOTKDP",{"v":75,"d":"$ 75.00"}]
["2025-08-27",null,"COMPRA DE TONER PARA IMPRESORA HP LASER (TONER, CABLE USB, CABLE DE PODER)",{"v":111.55,"d":"$ 111.55"}]
["2025-08-28",null,"REPARACIÓN IMPRESORA HP LASER DE OFICINA ASOTKDP",{"v":46,"d":"$ 46.00"}]
[null,null,"TOTAL",{"$f":"SUM(D7:D36)","v":{"v":339,"d":"$ 339.00"}}]
[]
[]
["FECHA","SUELDOS Y SALARIOS","DETALLE","VALOR",null,{"$f":"SUM(D41:D67)","v":{"v":10107.5,"d":"$ 10,107.50"}}]
["2025-04-08",null,"PAGO AUXILIAR Y APOYO TATIANA SIMBAÑA MARZO (MEDIO TIEMPO)",{"v":250,"d":"$ 250.00"}]
["2025-04-21",null,"PAGO AUXILIAR Y APOYO MICAELA PARRA ABRIL (MEDIO TIEMPO)",{"v":100,"d":"$ 100.00"}]
["2025-05-09",null,"PAGO AUXILIAR Y APOYO LOREN BRICEÑO MAYO (MEDIO TIEMPO)",{"v":250,"d":"$ 250.00"}]
["2025-07-07",null,"PAGO AUXILIAR Y APOYO LOREN BRICEÑO JUNIO (MEDIO TIEMPO)",{"v":250,"d":"$ 250.00"}]
["2025-07-31",null,"PAGO AUXILIAR Y APOYO LOREN BRICEÑO JULIO (MEDIO TIEMPO)",{"v":250,"d":"$ 250.00"}]
["2025-04-15",null,"PAGO RUTH GUANO SERVICIO DE LIMPIEZA MES DE MARZO (MEDIO TIEMPO)",{"v":250,"d":"$ 250.00"}]
["2025-05-05",null,"PAGO RUTH GUANO SERVICIO DE LIMPIEZA MES DE ABRIL (MEDIO TIEMPO)",{"v":250,"d":"$ 250.00"}]
["2025-06-09",null,"PAGO RUTH GUANO SERVICIO DE LIMPIEZA MES DE MAYO (MEDIO TIEMPO)",{"v":250,"d":"$ 250.00"}]
["2025-07-08",null,"PAGO RUTH GUANO SERVICIO DE LIMPIEZA MES DE JUNIO (MEDIO TIEMPO)",{"v":250,"d":"$ 250.00"}]
["2025-07-31",null,"PAGO RUTH GUANO SERVICIO DE LIMPIEZA MES DE JULIO (MEDIO TIEMPO)",{"v":250,"d":"$ 250.00"}]
["2025-09-02",null,"PAGO RUTH GUANO SERVICIO DE LIMPIEZA MES DE AGOSTO (MEDIO TIEMPO)",{"v":250,"d":"$ 250.00"}]
["2025-04-08",null,"PAGO  SECRETARIA DAYANA FOLLECO MARZO",{"v":470,"d":"$ 470.00"}]
["2025-05-05",null,"PAGO  SECRETARIA DAYANA FOLLECO ABRIL",{"v":470,"d":"$ 470.00"}]
["2025-06-09",null,"PAGO  SECRETARIA DAYANA FOLLECO MAYO",{"v":470,"d":"$ 470.00"}]
["2025-07-07",null,"PAGO  SECRETARIA DAYANA FOLLECO JUNIO",{"v":470,"d":"$ 470.00"}]
["2025-07-31",null,"PAGO  SECRETARIA DAYANA FOLLECO JULIO",{"v":470,"d":"$ 470.00"}]
["2025-09-02",null,"PAGO  SECRETARIA DAYANA FOLLECO AGOSTO",{"v":470,"d":"$ 470.00"}]
["2025-04-24",null,"PAGO MARCELO TROYA SERVICIOS ENTRENADOR PROVINCIAL DE APOYO MARZO",{"v":650,"d":"$ 650.00"}]
["2025-05-05",null,"PAGO MARCELO TROYA SERVICIOS ENTRENADOR PROVINCIAL DE APOYO ABRIL",{"v":650,"d":"$ 650.00"}]
["2025-06-09",null,"PAGO MARCELO TROYA SERVICIOS ENTRENADOR PROVINCIAL DE APOYO MAYO",{"v":650,"d":"$ 650.00"}]
["2025-07-07",null,"PAGO MARCELO TROYA SERVICIOS ENTRENADOR PROVINCIAL DE APOYO JUNIO",{"v":650,"d":"$ 650.00"}]
["2025-08-05",null,"PAGO MARCELO TROYA SERVICIOS ENTRENADOR PROVINCIAL DE APOYO JULIO",{"v":650,"d":"$ 650.00"}]
["2025-09-02",null,"PAGO MARCELO TROYA SERVICIOS ENTRENADOR PROVINCIAL DE APOYO AGOSTO",{"v":400,"d":"$ 400.00"}]
["2025-05-10",null,"ESTALIN FERNANDO VILLARROEL SERVICIO DE ENTRENAMIENTO MENTAL SALDO PENDIENTE",{"v":900,"d":"$ 900.00"}]
["2025-08-26",null,"PAGO AUXILIAR Y APOYO MICAELA PARRA REALIZACIÓN DE INVENTARIO EN BODEGA ASOTKDP",{"v":36,"d":"$ 36.00"}]
["2025-04-30",null,"TRÁMITES Y ASESORÍA SRI EDUARDO LOACHAMIN CRUCE POR TRÁMITE 30-04-2025",{"v":31.5,"d":"$ 31.50"}]
["2025-04-30",null,"CRUCE DE DEUDAS PERMISO DE FUNCIONAMIENTO POR TRÁMITES DE SRI DE ASOTKDP ",{"v":70,"d":"$ 70.00"}]
[null,null,"TOTAL",{"$f":"SUM(D41:D67)","v":{"v":10107.5,"d":"$ 10,107.50"}}]
[]
[]
["FECHA","INTERNET Y TELEFONÍA","DETALLE","VALOR",null,{"$f":"SUM(D72:D81)","v":{"v":407.38,"d":"$ 407.38"}}]
["2025-04-08",null,"SERVICIO DE INTERNET FIJO CELERITY ABRIL",{"v":40.5,"d":"$ 40.50"}]
["2025-04-15",null,"PAGO PLAN CELULAR ASOTKDP ABRIL",{"v":36.59,"d":"$ 36.59"}]
["2025-05-07",null,"SERVICIO DE INTERNET FIJO CELERITY MAYO",{"v":42.8,"d":"$ 42.80"}]
["2025-05-12",null,"PAGO PLAN CELULAR ASOTKDP MAYO",{"v":41.68,"d":"$ 41.68"}]
["2025-06-09",null,"SERVICIO DE INTERNET FIJO CELERITY JUNIO",{"v":42.8,"d":"$ 42.80"}]
["2025-06-09",null,"PAGO PLAN CELULAR ASOTKDP JUNIO",{"v":40.44,"d":"$ 40.44"}]
["2025-07-08",null,"SERVICIO DE INTERNET FIJO CELERITYJULIO",{"v":42.8,"d":"$ 42.80"}]
["2025-07-11",null,"PAGO PLAN CELULAR ASOTKDP JULIO",{"v":40.44,"d":"$ 40.44"}]
["2025-08-08",null,"SERVICIO DE INTERNET FIJO CELERITY AGOSTO",{"v":42.8,"d":"$ 42.80"}]
["2025-08-08",null,"PAGO PLAN CELULAR ASOTKDP AGOSTO",{"v":36.53,"d":"$ 36.53"}]
[null,null,"TOTAL",{"$f":"SUM(D72:D81)","v":{"v":407.38,"d":"$ 407.38"}}]
[]
[]
["FECHA","ARREGLO Y MANTENIMIENTO DE INSTALACIONES","DETALLE","VALOR",null,{"$f":"SUM(D86:D126)","v":{"v":4048.3700000000003,"d":"$ 4,048.37"}}]
["2025-04-08","JUAN CARLOS PIARPUSAN PEREIRA","MANTENIMIENTO Y ALBAÑILERÍA PAGO DE UNA SEMANA (SALA DE AUDIOVISUALES Y CAMERINOS)",{"v":160,"d":"$ 160.00"}]
["2025-04-09","CORAL HIPERMERCADOS","COMPRA DE LUCES LED PARA CAMBIO EN ESCENARIOS ASOTKDP",{"v":30.27,"d":"$ 30.27"}]
["2025-04-11","FERRETEROS BS","COMPRA DE MATERIALES DE FERRETERÍA  PARA ARREGLOS EN VICENTINA (CADENA, CÁNCAMO, SIFÓN FLEXIBLE, MOQUETÓN, CEMENTO, BROCAS Y SOPORTE DE TV)",{"v":41.48,"d":"$ 41.48"}]
["2025-04-11","FERRETEROS BS","COMPRA DE MATERIALES DE FERRETERÍA  PARA ARREGLOS EN VICENTINA (CADENA, THINNER, MOQUETÓN Y EMPAQUES CÓNICOS)",{"v":39.78,"d":"$ 39.78"}]
["2025-04-14","SAMUEL ARDILA","CAMBIO DE LUMINARIAS Y MANTENIMIENTO ÁREA SUPERIOR ASOTKDP",{"v":200,"d":"$ 200.00"}]
["2025-04-16","FERRETEROS BS","COMPRA DE MATERIALES DE FERRETERÍA PARA ARREGLOS EN VICENTINA (SIFÓN FLEXIBLE, VIKINGO LLAVE, BROCA, TORNILLO, GUATES DE CAUCHO)",{"v":11.27,"d":"$ 11.27"}]
["2025-04-16","FERRETEROS BS","COMPRA DE MATERIALES DE FERRETERÍA PARA ARREGLOS EN VICENTINA (SIFÓN FLEXIBLE, BISAGRA, TORNILLO MDF, DESARMADOR, MANGUERA ABASTO METAL)",{"v":10.17,"d":"$ 10.17"}]
["2025-04-16","FERRETEROS BS","COMPRA DE MATERIALES DE FERRETERÍA PARA ARREGLOS EN VICENTINA (CABLE, CINTA TEFLÓN, ENCHUFE, TOMA, CAJA DEXSON, DESARMADOR, SILICON CARTUCHO, PUNTA DE TALADRO, TACO FISCHER, BROCA, BONDEX))",{"v":20.03,"d":"$ 20.03"}]
["2025-04-16","SAMUEL ARDILA","SERVICIOS EN PINTURA DE TECHO ÁREA SUPERIOR ASOTKDP",{"v":1000,"d":"$ 1,000.00"}]
["2025-04-16","SAMUEL ARDILA","ABONO POR INSTALACIONES Y COMPRA DE LUMINARIAS EN ASOTKDP",{"v":712.8,"d":"$ 712.80"}]
["2025-04-17","FERRETEROS BS","COMPRA DE MATERIALES DE FERRETERÍA PARA ARREGLOS EN VICENTINA (GUANTE CAUCHO, LLANA CABO, LIJA DE AGUA, EMPASTE)",{"v":16.42,"d":"$ 16.42"}]
["2025-04-17","FERRETEROS BS","COMPRA DE MATERIALES DE FERRETERÍA PARA ARREGLOS EN VICENTINA (BREAKER SQD 50 AMP)",{"v":7.71,"d":"$ 7.71"}]
["2025-04-17","FERRETEROS BS","COMPRA DE MATERIALES DE FERRETERÍA PARA ARREGLOS EN VICENTINA (POLWAX INCOLORO Y TRAPEADOR)",{"v":8.75,"d":"$ 8.75"}]
["2025-04-17","SAMUEL ARDILA","MANTENIMIENTO Y ARREGLOS EN INSTALACIONES DE ASOTKDP",{"v":120,"d":"$ 120.00"}]
["2025-04-19","FERRETEROS BS","COMPRA DE MATERIALES DE FERRETERÍA PARA ARREGLOS EN VICENTINA (ABRO MASTIKO 110CMX25CM)",{"v":5.7,"d":"$ 5.70"}]
["2025-04-21","FERRETEROS BS","COMPRA DE MATERIALES DE FERRETERÍA PARA ARREGLOS EN VICENTINA (ELECTROCABLE CONCÉNTRICO, TORNILLO TIPO LENTEJA, PUNTA DE TALADRO)",{"v":15.05,"d":"$ 15.05"}]
["2025-04-21","FERRETEROS BS","COMPRA DE MATERIALES DE FERRETERÍA PARA ARREGLOS EN VICENTINA (TOMA, CANALETA,CABLE GEMELO, ENCHUFE DE CAUCHO, ABRO SILICON, GARRUCHA)",{"v":22.86,"d":"$ 22.86"}]
["2025-04-22","FERRETEROS BS","COMPRA DE MATERIALES DE FERRETERÍA PARA ARREGLOS EN VICENTINA (ADAPTADOR 3 EN 1)",{"v":1.6,"d":"$ 1.60"}]
["2025-04-25","SAMUEL ARDILA","TRABAJOS DE CARPINTERÍA PARA REPARACIÓN DE PATAS DE LOS MUEBLES",{"v":15,"d":"$ 15.00"}]
["2025-04-25","SAMUEL ARDILA","CAMBIO DE LUMINARIAS Y MANTENIMIENTO ÁREA SUPERIOR ASOTKDP",{"v":100,"d":"$ 100.00"}]
["2025-04-25","SAMUEL ARDILA","ARREGLOS VARIOS ASOTKDP",{"v":231,"d":"$ 231.00"}]
["2025-04-29","FERRETEROS BS","COMPRA DE MATERIALES DE FERRETERÍA PARA ARREGLOS EN VICENTINA (CINTA DE TELA GRIS, CINTA ANTIDESLIZ, PEGAMENTO, ESTILETE, BROCHA)",{"v":15.56,"d":"$ 15.56"}]
["2025-04-30","FERRETEROS BS","COMPRA DE MATERIALES DE FERRETERÍA PARA ARREGLOS EN VICENTINA (CINTA DE TELA GRIS)",{"v":6.8,"d":"$ 6.80"}]
["2025-04-30","FERRETEROS BS","COMPRA DE MATERIALES DE FERRETERÍA PARA ARREGLOS EN VICENTINA (TUBO, NEPLO, UNIÓN, LLAVE ESFÉRICA, PEGAMENTO, HOJA DE SIERRA, CINTA DE TEFLÓN,ETC)",{"v":19.75,"d":"$ 19.75"}]
["2025-05-05","SAMUEL ARDILA","PAGO DE SALDO FINAL POR ARREGLO Y MANTENIMIENTO DE INSTALACIONES ASOTKDP",{"v":987,"d":"$ 987.00"}]
["2025-05-08",null,"COPIAS LLAVES DE LA BODEGA AOTKDP EN EL COLISEO LOS QUITUS",{"v":0.85,"d":"$ 0.85"}]
["2025-05-09","FERRETEROS BS","COMPRA DE CINTA DE TELA GRIS PARA DIVISIÓN DE CACHAS PARA COMPETENCIAS ASOTKDP",{"v":6.8,"d":"$ 6.80"}]
["2025-05-13","FERRETEROS BS","COMPRA DE MATERIALES DE FERRETERÍA PARA ARREGLOS EN VICENTINA (CINTA ANTIDESLIZ Y CINTA DUCTO)",{"v":9.96,"d":"$ 9.96"}]
["2025-05-15",null,"COMPRA DE MATERIALES DE FERRETERÍA (GOMA LÍQUIDA)",{"v":3.5,"d":"$ 3.50"}]
["2025-05-16",null,"COMPRA DE MATERIALES DE FERRETERÍA (CINTA DUCTO Y AMARRAS)",{"v":8.2,"d":"$ 8.20"}]
["2025-05-16",null,"COMPRA DE MATERIALES DE FERRETERÍA (KALIPEGA, CINTA DUCTO Y PEGAMENTO LLAMA)",{"v":17.78,"d":"$ 17.78"}]
["2025-05-16",null,"COMPRA DE MATERIALES DE FERRETERÍA (DUCTO DE ALUMINIO, CINTA MASKING Y AMARRAS)",{"v":9.9,"d":"$ 9.90"}]
["2025-05-20",null,"COMPRA DE MATERIALES DE FERRETERÍA (GOMA LÍQUIDA)",{"v":5.49,"d":"$ 5.49"}]
["2025-06-12","SAMUEL ARDILA","PAGO POR REPARACIÓN Y MANTENIMIENTO DE TATAMI OLÍMPICO",{"v":29,"d":"$ 29.00"}]
["2025-06-12",null,"COMPRA DE MATERIALES DE FERRETERÍA (TORNILLOS, PIOLA PLÁSTICA, BROCA, COLA BLANCA, PEGAMENTO, ETC.)",{"v":26.34,"d":"$ 26.34"}]
["2025-06-13",null,"COMPRA DE MATERIALES DE FERRETERÍA (BONDER)",{"v":2.6,"d":"$ 2.60"}]
["2025-07-17",null,"COMPRA DE MATERIALES DE FERRETERÍA (DISPENSADOR DE JABÓN)",{"v":4.95,"d":"$ 4.95"}]
["2025-07-26",null,"COMPRA DE MATERIALES DE FERRETERÍA (CANDADO, COPIA DE LLAVES)",{"v":2.6,"d":"$ 2.60"}]
["2025-07-29",null,"COMPRA DE MATERIALES DE FERRETERÍA (CANDADO DE MUSEO DE ARTE COLONIAL)",{"v":19.9,"d":"$ 19.90"}]
["2025-08-08",null,"COMPRA DE MATERIALES DE FERRETERÍA (PAQUETE DE AMARRAS)",{"v":1.5,"d":"$ 1.50"}]
["2025-09-02",null,"ABONO POR MANTENIMIENTO Y MARCO DE MADERA PARA TATAMI OLÍMPICO ",{"v":100,"d":"$ 100.00"}]
[null,null,"TOTAL",{"$f":"SUM(D86:D126)","v":{"v":4048.3700000000003,"d":"$ 4,048.37"}}]
[]
[]
["FECHA","AYUDA ECONÓMICA","DETALLE","VALOR",null,{"$f":"SUM(D131:D137)","v":{"v":2547.68,"d":"$ 2,547.68"}}]
["2025-04-24",null,"IMPRESIÓN DE GAL DEPORTISTA DE CAPACIDADES ESPECIALES ARLETTE GONZÁLES",{"v":2,"d":"$ 2.00"}]
["2025-06-26",null,"COMPRA DE RECETA PARA DEPORTISTA DE PARATKD ARLETTE GONZÁLES (COLÁGENO Y DOLTREX)",{"v":45.68,"d":"$ 45.68"}]
["2025-05-10",null,"APOYO PARA WORLD MASTER GAMES DAYANA FOLLECO",{"v":500,"d":"$ 500.00"}]
["2255-05-18",null,"APOYO PARA WORLD MASTER GAMES JIMMY BOLAÑOS",{"v":500,"d":"$ 500.00"}]
["2025-05-18",null,"APOYO PARA WORLD MASTER GAMES MARCELO PRADO",{"v":500,"d":"$ 500.00"}]
["2025-05-18",null,"APOYO PARA WORLD MASTER GAMES PAÚL ORELLANA",{"v":500,"d":"$ 500.00"}]
["2025-05-18",null,"APOYO PARA WORLD MASTER GAMES  A DELEGADO",{"v":500,"d":"$ 500.00"}]
[null,null,"TOTAL",{"$f":"SUM(D131:D137)","v":{"v":2547.68,"d":"$ 2,547.68"}}]
[]
[]
["FECHA","TRANSPORTE","DETALLE","VALOR",null,{"$f":"SUM(D142:D169)","v":{"v":297.83000000000004,"d":"$ 297.83"}}]
["2025-04-07",null,"MOVILIZACIÓN PARA COMPRA DE CARTONES PARA CLASIFICAR OBJETOS DE BODEGA",{"v":1.93,"d":"$ 1.93"}]
["2025-04-10",null,"MOVILIZACIÓN PARA GESTIONES BANCARIAS",{"v":3.7,"d":"$ 3.70"}]
["2025-04-10",null,"MOVILIZACIÓN PARA CAMBIO DE CHEQUE (FONDOS A NOMBRE DE PROF ANDRÉS NICOLALDE PARA TOPE JUVENIL EN BAÑOS)",{"v":10,"d":"$ 10.00"}]
["2025-04-14",null,"MOVILIZACIÓN PARA COMPRA DE MICAS  Y GESTIONES MINISTERIO DEL DEPORTE",{"v":1.75,"d":"$ 1.75"}]
["2025-04-16",null,"MOVILIZACIÓN PARA COMPRA DE MICAS  Y GESTIONES MINISTERIO DEL DEPORTE",{"v":1.4,"d":"$ 1.40"}]
["2025-05-05",null,"MOVILIZACIÓN PARA RETIRAR ENCOMIENDA (FACTURAS DE MANABÍ)",{"v":4,"d":"$ 4.00"}]
["2025-05-07",null,"MOVILIZACIÓN PARA NOTARIZAR DOCUMENTOS ASOTKDP",{"v":3,"d":"$ 3.00"}]
["2025-05-09",null,"MOVILIZACIÓN PARA STICKERS, TROFEOS Y PLACAS PARA CAMPEONATO DE EDADES ESCOLARES 2025",{"v":10,"d":"$ 10.00"}]
["2025-05-09",null,"PAGO FLETES PARA TRANSPORTAR MENAJE DE COMPETENCIA DE COLISEO LOS QUITUS AL RUMIÑAHUI",{"v":60,"d":"$ 60.00"}]
["2025-05-13",null,"MOVILIZACIÓN PARA ENTREGA DE ENTRADAS INVITADOS ESPECIALES EXHIBICIÓN KUKKIWON",{"v":6.5,"d":"$ 6.50"}]
["2025-05-22",null,"MOVILIZACIÓN PARA ESTAMPADOS EN CAMISETAS PARA VIAJE A TAIWÁN",{"v":5,"d":"$5.00"}]
["2025-06-09",null,"PAGO FLETE MENAJE DE COMPETENCIA A SELECTIVO EN MITAD DEL MUNDO (22-03-2025)",{"v":35,"d":"$35.00"}]
["2025-06-12",null,"MOVILIZACIÓN PARA COMPRA DE MATERIALES DE FERRETERÍA",{"v":5,"d":"$5.00"}]
["2025-06-16",null,"PAGO ENVÍO POR ENCOMIENDA A ESMERALDAS DE UNIFORMES ASOTKDP",{"v":5,"d":"$5.00"}]
["2025-06-16",null,"PAGO ENVÍO POR ENCOMIENDA A MANABÍ DE UNIFORMES ASOTKDP",{"v":6,"d":"$6.00"}]
["2025-06-18",null,"MOVILIZACIÓN PARA ENTREGA DE UNIFORMES ASOTKDP PARA VIAJE A PERÚ",{"v":10.65,"d":"$10.65"}]
["2025-06-27",null,"MOVILIZACIÓN PROF. WILSON RODRÍGUEZ APOYO TÉCNICO JUEGOS NACIONALES JUVENILES",{"v":20,"d":"$ 20.00"}]
["2025-07-04",null,"PAGO FLETE MENAJE DE COMPETENCIA DE LOS QUITUS AL RUMIÑAHUI PARA II OPEN NOV. INTERM.",{"v":50,"d":"$ 50.00"}]
["2025-08-12",null,"PAGO ENVÍO POR ENCOMIENDA A EL ORO DE UNIFORMES ASOTKDP",{"v":4.5,"d":"$ 4.50"}]
["2025-08-12",null,"MOVILIZACIÓN PARA  ENCOMIENDA A EL ORO DE UNIFORMES ASOTKDP",{"v":4,"d":"$ 4.00"}]
["2025-07-21",null,"MOVILIZACIÓN PARA ENTREGA DE INVITACIONES A SESIÓN SOLEMNE (MINISTERIO DEL DEPORTE)",{"v":5,"d":"$ 5.00"}]
["2025-07-22",null,"MOVILIZACIÓN PARA ENTREGA DE INVITACIONES A SESIÓN SOLEMNE (EMBAJADA Y VICEPRESIDENCIA)",{"v":14.8,"d":"$ 14.80"}]
["2025-07-31",null,"MOVILIZACIÓN OFICINA - MUSEO DE ARTE COLONIAL PARA SESIÓN SOLEMNE",{"v":3.1,"d":"$ 3.10"}]
["2025-07-31",null,"MOVILIZACIÓN RETIRAR DONACIÓN DE BANDERAS DE ECUADOR EMBAJADA DE COREA",{"v":7.1,"d":"$ 7.10"}]
["2025-08-12",null,"MOVILIZACIÓNTABLAS DE ROMPIMIENTO PARA EXHIBICIÓN EMBAJADA DE COREA",{"v":4,"d":"$ 4.00"}]
["2025-08-14",null,"MOVILIZACIÓN PARA GESTIONES MINISTERIO DEL DEPORTE",{"v":6,"d":"$ 6.00"}]
["2025-08-18",null,"MOVILIZACIÓN POR JORNADA DE TRABAJO EXTENDIDA",{"v":4.4,"d":"$ 4.40"}]
["2025-08-19",null,"MOVILIZACIÓN PARA REPARACIÓN DE IMPRESORA LÁSER HP",{"v":6,"d":"$ 6.00"}]
[null,null,"TOTAL",{"$f":"SUM(D142:D169)","v":{"v":297.83000000000004,"d":"$ 297.83"}}]
[]
[]
["FECHA","REDES Y PUBLICACIONES","DETALLE","VALOR",null,{"$f":"SUM(D174:D178)","v":{"v":750,"d":"$ 750.00"}}]
["2025-04-10",null," MANEJO DE MEDIOS Y REDES SOCIALES MARZO",{"v":150,"d":"$ 150.00"},"DEPÓSITO"]
["2025-05-05",null," MANEJO DE MEDIOS Y REDES SOCIALES ABRIL",{"v":150,"d":"$ 150.00"},"DEPÓSITO"]
["2025-06-09",null," MANEJO DE MEDIOS Y REDES SOCIALES  MAYO",{"v":150,"d":"$ 150.00"},"DEPÓSITO"]
["2025-08-07",null," MANEJO DE MEDIOS Y REDES SOCIALES  JUNIO",{"v":150,"d":"$ 150.00"}]
["2025-09-02",null," MANEJO DE MEDIOS Y REDES SOCIALES JULIO",{"v":150,"d":"$ 150.00"}]
[null,null,"TOTAL",{"$f":"SUM(D174:D178)","v":{"v":750,"d":"$ 750.00"}}]
[]
[]
["FECHA","MATERIAL IMPRESO Y MICAS (GAL)","DETALLE","VALOR",null,{"$f":"SUM(D183:D189)","v":{"v":319.9,"d":"$ 319.90"}}]
["2025-03-19",null,"COMPRA DE 5 PAQUETES (50 UNIDADES) MICAS PARA CARNETS ",{"v":20,"d":"$ 20.00"}]
["2025-03-20",null,"IMPRESIÓN DE SEÑALÉTICA PARA EVENTOS",{"v":11.1,"d":"$ 11.10"}]
["2025-04-04",null,"IMPRESIÓN DE PERMISOS DE FUNCIONAMIENTO 2025",{"v":50.8,"d":"$ 50.80"}]
["2025-04-14",null,"COMPRA DE 10 PAQUETES DE MICAS PARA CARNETS",{"v":40,"d":"$ 40.00"}]
["2025-05-09",null,"IMPRESIÓN DE 260 STICKERS PARA MEDALLAS DE CAMPEONATO EDADES ESCOLARES 2025",{"v":18,"d":"$ 18.00"}]
["2025-07-23",null,"IMPRESIÓN DE BOLETOS DE ($2) PARA TAQUILLA DE EVENTOS ASOTKDP",{"v":160,"d":"$ 160.00"}]
["2025-08-22",null,"COMPRA DE 5 PAQUETES DE MICAS PARA CARNETS",{"v":20,"d":"$ 20.00"}]
[null,null,"TOTAL",{"$f":"SUM(D183:D189)","v":{"v":319.9,"d":"$ 319.90"}}]
[]
[]
["FECHA","ALIMENTACIÓN Y CAFETERÍA","DETALLE","VALOR",null,{"$f":"SUM(D194:D236)","v":{"v":1331.71,"d":"$ 1,331.71"}}]
["2025-03-18",null,"COMPRA DE BOTELLAS DE AGUA PARA CEREMONIA DE ASCENSO ASOTKD-P",{"v":2.5,"d":"$ 2.50"}]
["2025-03-19",null,"RECARGA DE AGUA EN BOTELLONES (HIDRATACIÓN DEPORTISTAS)",{"v":4.05,"d":"$ 4.05"}]
["2025-03-19",null,"COMPRA DE DETALLE FALTANTE PARA DEPORTISTA DE INICICACIÓN POR ASCENSO DE CINTURÓN",{"v":1.55,"d":"$ 1.55"}]
["2025-03-19",null,"COMPRA DE REFRIGERIO EN REUNIÓN DE DIRECTORIO INCLUÍDO DELIVERY",{"v":51,"d":"$ 51.00"}]
["2025-03-20",null,"COMPRA DE PRODUCTOS DE CAFETERÍA (SALA DE  ESTAR ASOTKD-P)",{"v":4.04,"d":"$ 4.04"}]
["2025-03-21",null,"COMPRA DE PRODUCTOS DE CAFETERÍA EVENTO POOMSAE CIUDAD MITAD DEL MUNDO",{"v":25,"d":"$ 25.00"}]
["2025-03-26",null,"COMPRA DE AGUA PARA MESA DIRECTIVA ASAMBLEA ORDINARIA (INFORME DE ACTIVIDADES Y ECONÓMICO)",{"v":0.8,"d":"$ 0.80"}]
["2025-03-26",null,"COMPRA DE PRODUCTOS DE CAFETERÍA PARA ASAMBLEA ORDINARIA (INFORME DE ACTIVIDADES Y ECONÓMICO)",{"v":39.69,"d":"$ 39.69"}]
["2025-03-28",null,"COMPRA DE PRODUCTOS DE CAFETERÍA (OFICINA DE  ESTAR ASOTKD-P)",{"v":3.4,"d":"$ 3.40"}]
["2025-04-01",null,"RECARGA DE AGUA EN BOTELLONES (HIDRATACIÓN DEPORTISTAS)",{"v":6.07,"d":"$ 6.07"}]
["2025-04-04",null,"PAGO ALIMENTACIÓN (ALMUERZO) DEPORTISTAS DE SELECCIÓN  Y DELEGACIONES INVITADAS A CAMPAMENTOS",{"v":250,"d":"$ 250.00"}]
["2025-04-09",null,"RECARGA DE AGUA EN BOTELLONES (HIDRATACIÓN DEPORTISTAS)",{"v":2.02,"d":"$ 2.02"}]
["2025-04-10",null,"COMPRA DE BOTELLAS DE AGUA PARA CEREMONIA FIRMA DE CONVENIO ASOTKD P - UNIVERSIDAD UDET",{"v":3.5,"d":"$ 3.50"}]
["2025-04-14",null,"COMPRA DE PRODUCTOS DE CAFEERÍA",{"v":1.05,"d":"$ 1.05"}]
["2025-04-14",null,"COMPRA DE EMPANADAS",{"v":1.4,"d":"$ 1.40"}]
["2025-04-16",null,"RECARGA DE AGUA EN BOTELLONES (HIDRATACIÓN DEPORTISTAS)",{"v":2.02,"d":"$ 2.02"}]
["2025-04-22",null,"RECARGA DE AGUA EN BOTELLONES (HIDRATACIÓN DEPORTISTAS)",{"v":4.05,"d":"$ 4.05"}]
["2025-05-08",null,"RECARGA DE AGUA EN BOTELLONES (HIDRATACIÓN DEPORTISTAS)",{"v":8.1,"d":"$ 8.10"}]
["2025-05-13",null,"COMPRA DE TÉ (COLABORACIÓN LANZAMIENTO DEL LIBRO ESTALIN VILLARROEL)",{"v":2.45,"d":"$ 2.45"}]
["2025-05-13",null,"COMPRA DE PRODUCTOS DE CAFETERÍA (COLABORACIÓN LANZAMIENTO DEL LIBRO ESTALIN VILLARROEL)",{"v":23.65,"d":"$ 23.65"}]
["2025-05-14",null,"COMPRA DE REFRIGERO REUNIÓN CON PERSONAL DE LA EMBAJADA DE COREA",{"v":10,"d":"$ 10.00"}]
["2025-05-16",null,"COMPRA DE GASEOSA PARA REFRIGERIO PERSONAL DE APOYO COPA EMBAJADOR DE COREA",{"v":1.85,"d":"$ 1.85"}]
["2025-05-18",null,"COMPRA DE AGUA PARA MESA DIRECTIVA CLAUSURA COPA EMBAJADOR DE COREA",{"v":1.73,"d":"$ 1.73"}]
["2025-05-22",null,"RECARGA DE AGUA EN BOTELLONES (HIDRATACIÓN DEPORTISTAS)",{"v":2.02,"d":"$ 2.02"}]
["2025-05-22",null,"RECARGA DE AGUA EN BOTELLONES (HIDRATACIÓN DEPORTISTAS)",{"v":4.05,"d":"$ 4.05"}]
["2025-06-05",null,"RECARGA DE AGUA EN BOTELLONES (HIDRATACIÓN DEPORTISTAS)",{"v":4.05,"d":"$ 4.05"}]
["2025-06-09",null,"PAGO ALIMENTACIÓN (ALMUERZO) DEPORTISTAS DE SELECCIÓN  Y DELEGACIONES INVITADAS A CAMPAMENTOS",{"v":312.75,"d":"$ 312.75"}]
["2025-06-11",null,"COMPRA DE PRODUCTOS DE CAFERÍA",{"v":4.79,"d":"$ 4.79"}]
["2025-06-13",null,"COMPRA DE DESAYUNO PARA PESONAL DE APOYO CAMPEONATO NACINAL INFANTIL",{"v":41.7,"d":"$ 41.70"}]
["2025-06-13",null,"COMPRA DE PRODUCTOS DE CAFERÍA",{"v":1.35,"d":"$ 1.35"}]
["2025-06-13",null,"COMPRA DE PRODUCTOS DE CAFERÍA (AGUA, AGUA MINERAL, GALLETAS, CARAMELOS)",{"v":10.2,"d":"$ 10.20"}]
["2025-06-13",null,"COMPRA DE PRODUCTOS DE CAFERÍA (AGUA, CAJA DE FÓSFOROS)",{"v":4,"d":"$ 4.00"}]
["2025-06-25",null,"RECARGA DE AGUA EN BOTELLONES (HIDRATACIÓN DEPORTISTAS)",{"v":10.26,"d":"$ 10.26"}]
["2025-07-10",null,"RECARGA DE AGUA EN BOTELLONES (HIDRATACIÓN DEPORTISTAS)",{"v":6.07,"d":"$ 6.07"}]
["2025-07-24",null,"RECARGA DE AGUA EN BOTELLONES (HIDRATACIÓN DEPORTISTAS)",{"v":4.05,"d":"$ 4.05"}]
["2025-07-25",null,"COMPRA DE PRODUCTOS DE CAFERÍA",{"v":4.04,"d":"$ 4.04"}]
["2025-07-30",null,"RECARGA DE AGUA EN BOTELLONES (HIDRATACIÓN DEPORTISTAS)",{"v":4.05,"d":"$ 4.05"}]
["2025-07-31",null,"COMPRA DE PRODUCTOS DE CAFERÍA (AZÚCAR, CAFÉ, CUCHARAS) EN SESIÓN SOLEMNE",{"v":4.6,"d":"$ 4.60"}]
["2025-08-12",null,"COMPRA DE PRODUCTOS DE CAFERÍA",{"v":8.7,"d":"$ 8.70"}]
["2025-08-15",null,"RECARGA DE AGUA EN BOTELLONES (HIDRATACIÓN DEPORTISTAS)",{"v":6.07,"d":"$ 6.07"}]
["2025-08-15",null,"COMPRA DE PRODUCTOS DE CAFETERÍA Y PANADERÍA REUNIÓN",{"v":10,"d":"$ 10.00"}]
["2025-09-01",null,"COMPRA DE PRODUCTOS PARA CAFETERÍA",{"v":4.04,"d":"$ 4.04"}]
["2025-09-02",null,"PAGO ALIMENTACIÓN (ALMUERZO) DEPORTISTAS DE SELECCIÓN  Y DELEGACIONES INVITADAS A CAMPAMENTOS",{"v":435,"d":"$ 435.00"}]
[null,null,"TOTAL",{"$f":"SUM(D194:D236)","v":{"v":1331.71,"d":"$ 1,331.71"}}]
[]
[]
["FECHA","PRODUCTOS Y UTENSILIOS DE LIMPIEZA","DETALLE","VALOR",null,{"$f":"SUM(D241:D270)","v":{"v":228.53,"d":"$ 228.53"}}]
["2025-03-27",null,"COMPRA DE GUANTES DE LIMPIEZA ",{"v":1.55,"d":"$ 1.55"}]
["2025-03-31",null,"COMPRA DE FUNDAS TIPO CAMISETA PARA ENTREGA DE UNIFORMES ASOTKDP",{"v":3,"d":"$ 3.00"}]
["2025-04-07",null,"COMPRA DE DETERGENTE Y SUAVIZANTE (LAVADO DE COBIJAS RESIDENCIA ATKDP)",{"v":6,"d":"$ 6.00"}]
["2025-04-07",null,"COMPRA DE CARTONES PARA BODEGA ",{"v":4,"d":"$ 4.00"}]
["2025-04-09",null,"COMPRA DE FUNDAS TAMAÑO JUMBO PARA BASURA",{"v":2,"d":"$ 2.00"}]
["2025-04-09",null,"COMPRA DE PAPEL HIGIÉNICO INSTITUCIONAL",{"v":7.2,"d":"$ 7.20"}]
["2025-04-14",null,"COMPRA DE FUNDAS DE BASURA ",{"v":1,"d":"$ 1.00"}]
["2025-04-16",null,"COMPRA DE BALDE PARA LIMPIEZA",{"v":2.25,"d":"$ 2.25"}]
["2025-04-16",null,"COMPRA DE FUNDAS TAMAÑO INDUSTRIAL PARA BASURA",{"v":1,"d":"$ 1.00"}]
["2025-04-16",null,"PAGO SERVICIO DE LAVANDERÍA MANTELES ASOTKDP",{"v":3.65,"d":"$ 3.65"}]
["2025-04-22",null,"COMPRA DE DETERGENTE Y FUNDAS DE BASURA",{"v":5,"d":"$ 5.00"}]
["2025-04-22",null,"COMPRA DE ESPONJAS DE LIMPIEZA Y LIMPIONES DE MICROFIBRA",{"v":2.88,"d":"$ 2.88"}]
["2025-04-30",null,"PAGO SERVICIO DE LAVANDERÍA COBIJAS DE RESIDENCIA ASOTKDP",{"v":27.75,"d":"$ 27.75"}]
["2025-05-01",null,"PAGO SERVICIO DE LAVANDERÍA COBIJAS DE RESIDENCIA ASOTKDP",{"v":22.15,"d":"$ 22.15"}]
["2025-05-08",null,"PAGO SERVICIO DE LAVANDERÍA MANTELES Y CHALECOS ASOTKDP",{"v":5.25,"d":"$ 5.25"}]
["2025-05-18",null,"COMPRA DE PAPEL HIGIÉNICO INSTITUCIONAL Y DESINFECTANTES",{"v":16.5,"d":"$ 16.50"}]
["2025-05-20",null,"COMPRA DE FUNDAS DE BASURA ",{"v":1,"d":"$ 1.00"}]
["2025-06-02",null,"PAGO SERVICIO DE LAVANDERÍA MANTELES Y CHALECOS ASOTKDP",{"v":4.3,"d":"$ 4.30"}]
["2025-06-10",null,"COMPRA DE FUNDAS DE BASURA ",{"v":2,"d":"$ 2.00"}]
["2025-06-18",null,"COMPRA DE FUNDAS DE BASURA ",{"v":1.8,"d":"$ 1.80"}]
["2025-07-01",null,"PAGO SERVICIO DE LAVANDERÍA MANTELES ASOTKDP",{"v":5.35,"d":"$ 5.35"}]
["2025-07-11",null,"PAGO SERVICIO DE LAVANDERÍA COBIJAS DE RESIDENCIA ASOTKDP",{"v":51.65,"d":"$ 51.65"}]
["2025-07-16",null,"PAGO SERVICIO DE LAVANDERÍA COBIJAS DE RESIDENCIA ASOTKDP",{"v":5.25,"d":"$ 5.25"}]
["2025-07-29",null,"COMPRA DE FUNDAS DE BASURA ",{"v":2,"d":"$ 2.00"}]
["2025-08-07",null,"COMPRA DE FUNDAS (TIPO CAMISETA PARA ENTREGA DE DOCUMENTOS O  VARIOS)",{"v":3.6,"d":"$ 3.60"}]
["2025-08-26",null,"COMPRA DE LAVAPLATOS",{"v":1.9,"d":"$ 1.90"}]
["2025-08-26",null,"COMPRA DE ESPONJA LAVAPLATOS",{"v":0.5,"d":"$ 0.50"}]
["2025-08-26",null,"COMPRA DE PRODUCTOS DE LIMPIEZA (GUANTES, FUNDAS DE BASURA, ESCOBA, ETC)",{"v":8.25,"d":"$ 8.25"}]
["2025-09-02",null,"PAGO SERVICIO DE LAVANDERÍA COBIJAS Y SÁBANAS DE RESIDENCIA ASOTKDP",{"v":20,"d":"$ 20.00"}]
["2025-09-02",null,"PAGO SERVICIO DE LAVANDERÍA COBIJAS Y SÁBANAS DE RESIDENCIA ASOTKDP",{"v":9.75,"d":"$ 9.75"}]
[null,null,"TOTAL",{"$f":"SUM(D241:D270)","v":{"v":228.53,"d":"$ 228.53"}}]
[]
[]
["FECHA","OTROS","DETALLE","VALOR",null,{"$f":"SUM(D275:D317)","v":{"v":9798.36,"d":"$ 9,798.36"}}]
["2025-04-01",null,"PAGO PARA ENVÍO DE DOCUMENTOS DE LA FETKD",{"v":10,"d":"$10.00"}]
["2025-04-25",null,"ARREGLO FLORAL DE CONDOLENCIAS",{"v":20,"d":"$20.00"}]
["2025-05-01","DANILO PÉREZ","RENOVACIÓN DE SISTEMA DE FACTURACIÓN FAST-FACT Y PAGO POR GESTIÓN DE TRÁMITES",{"v":26.5,"d":"$26.50"}]
["2025-05-07",null,"NOTARIZAR DOCUMENTOS ASOTKDP (LISTADOS CAMPEONATO NACIONAL MENORES 2025)",{"v":8.23,"d":"$8.23"}]
["2025-05-07",null,"NOTARIZAR DOCUMENTOS ASOTKDP (LISTADOS CAMPEONATO NACIONAL PREJUVENIL 2025)",{"v":8.23,"d":"$8.23"}]
["2025-05-07",null,"NOTARIZAR DOCUMENTOS ASOTKDP (LISTADOS CAMPEONATO NACIONAL U22 2025)",{"v":4.12,"d":"$4.12"}]
["2025-05-09",null,"TROFEOS Y PLACAS PARA CAMPEONATO DE EDADES ESCOLARES 2025",{"v":56,"d":"$56.00"}]
["2025-05-05",null,"CLUB JERATHEL HACE USO DE SALDO A FAVOR DISPONIBLE DEL TRÁMITE DEL 11-02-2025",{"v":2,"d":"$2.00"}]
["2025-05-10",null,"COMPRA DE PRODUCTOS VARIOS PARA USO EN OFICINA (REGLETA, PAPEL HIGIÉNICO Y PAN)",{"v":20,"d":"$20.00"}]
["2025-05-13",null,"COMPRA DE PRODUCTOS PARA BRINDIS  (GRAND DUVAL Y BISCOTELAS COLABORACIÓN LANZAMIENTO DEL LIBRO ESTALIN VILLARROEL)",{"v":35.26,"d":"$ 35.26"}]
["2025-05-13",null,"COMPRA DE PRODUCTOS PARA BRINDIS  (COPAS Y VASOS COLABORACIÓN LANZAMIENTO DEL LIBRO ESTALIN VILLARROEL)",{"v":3.7,"d":"$ 3.70"}]
["2025-05-22",null,"PAGO ESTAMPADOS EN CAMISETAS PARA VIAJE A TAIWÁN",{"v":25,"d":"$25.00"}]
["2025-05-27",null,"CLUB BAEKJUL TEAM AYALAZ HACE USO DE SALDO A FAVOR DISPONIBLE DE SALDO DE INSCRIPCIPCIONES",{"v":15,"d":"$15.00"}]
["2025-06-12",null,"COMPRA DE 6 TAGS DE INGRESO PUERTA PRINCIPAL-HABITACIONES ",{"v":24,"d":"$24.00"}]
["2025-06-17",null,"PAGO ESTAMPADOS DE ECUADOR EN UNIFORMES ASOTKDP",{"v":20,"d":"$20.00"}]
["2025-07-01",null,"PAGO SALDO JARROS PARA PROFESORES POR EL DÍA DEL PADRE CAMPEONATO NACIONAL INFANTIL",{"v":50,"d":"$50.00"}]
["2025-01-09",null,"PAGO POR GESTIÓN DE FIRMA ELECTRÓNICA PROF. GALO GARZÓN Y USO DE SISTEMA DE FIRMA ELECTRÓNICA",{"v":48,"d":"$48.00"}]
["2025-07-16",null,"NOTARIZAR DOCUMENTOS ASOTKDP (CERTIFICACIÓN DE DOCUEMENTOS EXHIBIDOS EN ORIGINAL)",{"v":2.06,"d":"$2.06"}]
["2025-07-11",null,"JARROS PARA PROFESORES POR EL DÍA DEL PADRE CAMPEONATO NACIONAL INFANTIL",{"v":20,"d":"$20.00"}]
["2025-07-23",null,"NOTARIZAR DOCUMENTOS ASOTKDP (CERTIFICACIÓN DE DOCUEMENTOS EXHIBIDOS EN ORIGINAL)",{"v":8.23,"d":"$8.23"}]
["2025-07-25",null,"GUÍA DE ARBITRAJE ACTUALIZADO CON SELECCIONADOS PROVINCIALES MIRIAN HERRERA",{"v":20,"d":"$20.00"}]
["2025-07-25",null,"GUÍA DE ARBITRAJE ACTUALIZADO CON SELECCIONADOS PROVINCIALES PATRICIA TÚQUERES",{"v":20,"d":"$20.00"}]
["2025-07-24",null,"SESION SOLEMNE BOCADILLOS (ABONO)",{"v":500,"d":"$500.00"}]
["2025-07-25",null,"SESIÓN SOLEMNE ABONO PLACAS DE RECONOCIMIENTO EN CEREMONIA (ABONO)",{"v":300,"d":"$300.00"}]
["2025-07-25",null,"INSTALACIÓN DE SOFTWARE PARA FIRMA ELECTRÓNICA PARA VICEPRESIDENCIA",{"v":15,"d":"$15.00"}]
["2025-07-26","SELECTIVO NACIONAL DE PARATKD","ALIMENTACIÓN STAFF",{"v":10.75,"d":"$10.75"}]
["2025-07-26","SELECTIVO NACIONAL DE PARATKD","REFRIGERIO STAFF",{"v":11.5,"d":"$11.50"}]
["2025-07-26","SELECTIVO NACIONAL DE PARATKD","PAGO STAFF (4 PERSONAS)",{"v":60,"d":"$60.00"}]
["2025-07-31",null,"SESIÓN SOLEMNE TRANSPORTE PARA PASANTES DE APOYO EN CEREMONIA",{"v":40,"d":"$40.00"}]
["2025-07-31",null,"SESIÓN SOLEMNE TRANSPORTE TROFEOS, BANDERAS, PERSONAL DE APOYO, ETC.",{"v":75,"d":"$75.00"}]
["2025-08-06",null,"COMPRA DE TABLAS DE ROMPIMIENTOS EXHIBICIÓN EVENTO HANMADANG",{"v":50,"d":"$50.00"}]
["2025-08-09",null,"SESION SOLEMNE BOCADILLOS (ABONO 2)",{"v":52,"d":"$52.00"}]
["2025-08-12",null,"COMPRA DE TABLAS DE ROMPIMIENTOS EXHIBICIÓN PARA EMBAJADA DE COREA",{"v":2.3,"d":"$ 2.30"}]
["2025-08-12",null,"SESIÓN SOLEMNE ABONO PLACAS DE RECONOCIMIENTO EN CEREMONIA (SALDO PENDIENTE)",{"v":885,"d":"$ 885.00"}]
["2025-08-12",null,"SESION SOLEMNE BOCADILLOS (SALDO FINAL)",{"v":143.4,"d":"$ 143.40"}]
["2025-08-12",null,"PAGO MAESTRO DE CEREMONIAS DE SESIÓN SOLEMNE",{"v":100,"d":"$ 100.00"}]
["2025-08-12",null,"PAGO SERVICIOS DE MENAJE DE EVENTOS (SESIÓN SOLEMNE - CURSO DE ARBITRAJE - HANMADANG)",{"v":568,"d":"$ 568.00"}]
["2025-08-12",null,"TRANSPORTE DE BANDERAS Y DEMÁS PARA SESIÓN SOLEMNE",{"v":15,"d":"$ 15.00"}]
["2025-08-13",null,"PAGO SERVICIOS DE LIMPIEZA EN SESIÓN SOLEMNE",{"v":20,"d":"$ 20.00"}]
["2025-08-13",null,"PAGO STAFF EN SESIÓN SOLEMNE (LOREN BRICEÑO Y DAYANA FOLLECO)",{"v":40,"d":"$ 40.00"}]
["VARIOS","FACTURA 11-02-2025","PAGOS CAMISETAS CURSO DE ACTUALIZACIÓN DE ENTRENADORES",{"v":4057.53,"d":"$ 4,057.53"}]
["VARIOS","FACTURA 20-05-2025","UNIFORMES PARA JUEGOS DE LA PROVINCIA",{"v":2066.55,"d":"$ 2,066.55"}]
["VARIOS",null,"OBSEQUIO UNIFORME ASOTKDP DEPORTISTAS DESTACADOS Y COLABORADORES",{"v":340,"d":"$ 340.00"}]
[null,null,"TOTAL",{"$f":"SUM(D275:D317)","v":{"v":9798.36,"d":"$ 9,798.36"}}]
[]
[]
[null,"INGRESOS",{"$f":"INGRESOS!G25","v":{"v":34706.36,"d":"$ 34,706.36"}}]
[null,"EGRESOS",{"$f":"G3","v":{"v":30176.260000000002,"d":"$ 30,176.26"}}]
[null,null,{"$f":"C321-C322","v":{"v":4530.0999999999985,"d":"$ 4,530.10"}},"SALDO"]

{"sheet":"CUENTAS POR COBRAR Y POR PAGAR","index":12,"n_rows":85,"n_cols":7,"rows_kept":85,"merged":[[1,1,1,5],[78,1,78,4],[79,2,79,3],[80,2,80,3],[81,2,81,3],[82,2,82,3],[83,2,83,3],[84,2,84,3]]}
[]
[null,"POR COBRAR",{"$nulls":4},{"$f":"SUM(F4:F78)","v":{"v":3637,"d":"$ 3,637.00"}}]
[]
[null,"AFILIACIONES Y PERMISOS DE FUNCIONAMIENTO 2024",{"$nulls":3},{"$f":"SUM(E6:E8)","v":{"v":240,"d":"$ 240.00"}}]
[null,null,"CLUB","REPRESENTANTE","DEUDA"]
[null,null,{"$f":"'AFILIACIONES Y PERMISOS 2024'!E32","v":"Deciap Norte"},{"$f":"'AFILIACIONES Y PERMISOS 2024'!F32","v":"Joel Mogollon"},{"$f":"'AFILIACIONES Y PERMISOS 2024'!J32","v":{"v":50,"d":"$ 50.00"}}]
[null,null,{"$f":"'AFILIACIONES Y PERMISOS 2024'!E107","v":"Tae Baek Junior Sucursal Solanda"},{"$f":"'AFILIACIONES Y PERMISOS 2024'!F107","v":"Edwin  Arteaga Jr."},{"$f":"'AFILIACIONES Y PERMISOS 2024'!J107","v":{"v":50,"d":"$ 50.00"}}]
[null,null,{"$f":"'AFILIACIONES Y PERMISOS 2024'!E126","v":"Valle"},{"$f":"'AFILIACIONES Y PERMISOS 2024'!F126","v":"Jorge Portilla"},{"$f":"'AFILIACIONES Y PERMISOS 2024'!J126","v":{"v":140,"d":"$ 140.00"}},"REAFILIACIÓN"]
[]
[]
[null,"AFILIACIONES Y PERMISOS DE FUNCIONAMIENTO 2025",{"$nulls":3},{"$f":"SUM(E13:E59)","v":{"v":3289,"d":"$ 3,289.00"}}]
[null,null,"CLUB","REPRESENTANTE","DEUDA"]
[null,null,{"$f":"'AFILIACIONES Y PERMISOS 2025'!E11","v":"Apolo"},{"$f":"'AFILIACIONES Y PERMISOS 2025'!F11","v":"Mario Pinto"},{"$f":"'AFILIACIONES Y PERMISOS 2025'!J11","v":{"v":70,"d":"$70.00"}}]
[null,null,{"$f":"'AFILIACIONES Y PERMISOS 2025'!E19","v":"Bas Panthers"},{"$f":"'AFILIACIONES Y PERMISOS 2025'!F19","v":"Jonatan Bastidas"},{"$f":"'AFILIACIONES Y PERMISOS 2025'!J19","v":{"v":70,"d":"$70.00"}}]
[null,null,{"$f":"'AFILIACIONES Y PERMISOS 2025'!E20","v":"Bas Panthers Pintag (Sucursal)"},{"$f":"'AFILIACIONES Y PERMISOS 2025'!F20","v":"Jonatan Bastidas"},{"$f":"'AFILIACIONES Y PERMISOS 2025'!J20","v":{"v":50,"d":"$50.00"}}]
[null,null,{"$f":"'AFILIACIONES Y PERMISOS 2025'!E24","v":"Ciudad de Quito (Sucursal)"},{"$f":"'AFILIACIONES Y PERMISOS 2025'!F24","v":"Adriana Obando"},{"$f":"'AFILIACIONES Y PERMISOS 2025'!J24","v":{"v":50,"d":"$50.00"}}]
[null,null,{"$f":"'AFILIACIONES Y PERMISOS 2025'!E25","v":"Condor"},{"$f":"'AFILIACIONES Y PERMISOS 2025'!F25","v":"Efren Torres"},{"$f":"'AFILIACIONES Y PERMISOS 2025'!J25","v":{"v":70,"d":"$70.00"}}]
[null,null,{"$f":"'AFILIACIONES Y PERMISOS 2025'!E28","v":"Chonkwon"},{"$f":"'AFILIACIONES Y PERMISOS 2025'!F28","v":"Christian Javier Huaraca  "},{"$f":"'AFILIACIONES Y PERMISOS 2025'!J28","v":{"v":70,"d":"$70.00"}}]
[null,null,{"$f":"'AFILIACIONES Y PERMISOS 2025'!E31","v":"Daigoro Sector El Beaterio  (Sucursal)"},{"$f":"'AFILIACIONES Y PERMISOS 2025'!F31","v":"Edison Pérez V."},{"$f":"'AFILIACIONES Y PERMISOS 2025'!J31","v":{"v":50,"d":"$50.00"}}]
[null,null,{"$f":"'AFILIACIONES Y PERMISOS 2025'!E36","v":"Deciap Norte  (Sucursal)"},{"$f":"'AFILIACIONES Y PERMISOS 2025'!F36","v":"Joel Mogollon"},{"$f":"'AFILIACIONES Y PERMISOS 2025'!J36","v":{"v":50,"d":"$50.00"}}]
[null,null,{"$f":"'AFILIACIONES Y PERMISOS 2025'!E41","v":"Ecuadcuba/ Black Panthers"},{"$f":"'AFILIACIONES Y PERMISOS 2025'!F41","v":"Eddy Cajigal  Kindelan"},{"$f":"'AFILIACIONES Y PERMISOS 2025'!J41","v":{"v":70,"d":"$70.00"}}]
[null,null,{"$f":"'AFILIACIONES Y PERMISOS 2025'!E45","v":"Farang"},{"$f":"'AFILIACIONES Y PERMISOS 2025'!F45","v":"Mesias Rojas"},{"$f":"'AFILIACIONES Y PERMISOS 2025'!J45","v":{"v":70,"d":"$70.00"}}]
[null,null,{"$f":"'AFILIACIONES Y PERMISOS 2025'!E46","v":"Fitt kwon do"},{"$f":"'AFILIACIONES Y PERMISOS 2025'!F46","v":"Galo Garzón "},{"$f":"'AFILIACIONES Y PERMISOS 2025'!J46","v":{"v":70,"d":"$70.00"}}]
[null,null,{"$f":"'AFILIACIONES Y PERMISOS 2025'!E47","v":"First Class Calderon"},{"$f":"'AFILIACIONES Y PERMISOS 2025'!F47","v":"Lenin Plazarte"},{"$f":"'AFILIACIONES Y PERMISOS 2025'!J47","v":{"v":20,"d":"$20.00"}}]
[null,null,{"$f":"'AFILIACIONES Y PERMISOS 2025'!E49","v":"Grand Master "},{"$f":"'AFILIACIONES Y PERMISOS 2025'!F49","v":"César Tayo"},{"$f":"'AFILIACIONES Y PERMISOS 2025'!J49","v":{"v":70,"d":"$70.00"}}]
[null,null,{"$f":"'AFILIACIONES Y PERMISOS 2025'!E50","v":"Goyang - Ideul"},{"$f":"'AFILIACIONES Y PERMISOS 2025'!F50","v":"Luis Elias Pisuña"},{"$f":"'AFILIACIONES Y PERMISOS 2025'!J50","v":{"v":70,"d":"$70.00"}}]
[null,null,{"$f":"'AFILIACIONES Y PERMISOS 2025'!E52","v":"Han Kum Do"},{"$f":"'AFILIACIONES Y PERMISOS 2025'!F52","v":"Nicole Tapia"},{"$f":"'AFILIACIONES Y PERMISOS 2025'!J52","v":{"v":200,"d":"$200.00"}}]
[null,null,{"$f":"'AFILIACIONES Y PERMISOS 2025'!E55","v":"Ilyo MP"},{"$f":"'AFILIACIONES Y PERMISOS 2025'!F55","v":"Miguel Parra"},{"$f":"'AFILIACIONES Y PERMISOS 2025'!J55","v":{"v":70,"d":"$70.00"}}]
[null,null,{"$f":"'AFILIACIONES Y PERMISOS 2025'!E57","v":"Joseon Legacy"},{"$f":"'AFILIACIONES Y PERMISOS 2025'!F57","v":"Fernando Moya"},{"$f":"'AFILIACIONES Y PERMISOS 2025'!J57","v":{"v":70,"d":"$70.00"}}]
[null,null,{"$f":"'AFILIACIONES Y PERMISOS 2025'!E58","v":"JR Sport"},{"$f":"'AFILIACIONES Y PERMISOS 2025'!F58","v":"Juan Carlos Ramírez"},{"$f":"'AFILIACIONES Y PERMISOS 2025'!J58","v":{"v":70,"d":"$70.00"}}]
[null,null,{"$f":"'AFILIACIONES Y PERMISOS 2025'!E59","v":"Juventus"},{"$f":"'AFILIACIONES Y PERMISOS 2025'!F59","v":"Jhony Pavón"},{"$f":"'AFILIACIONES Y PERMISOS 2025'!J59","v":{"v":70,"d":"$70.00"}}]
[null,null,{"$f":"'AFILIACIONES Y PERMISOS 2025'!E65","v":"Ko América Dragon de Fuego  (Sucursal)"},{"$f":"'AFILIACIONES Y PERMISOS 2025'!F65","v":"Luis Sandoval"},{"$f":"'AFILIACIONES Y PERMISOS 2025'!J65","v":{"v":50,"d":"$50.00"}}]
[null,null,{"$f":"'AFILIACIONES Y PERMISOS 2025'!E66","v":"Korean Dragon"},{"$f":"'AFILIACIONES Y PERMISOS 2025'!F66","v":"Fabián Moreno"},{"$f":"'AFILIACIONES Y PERMISOS 2025'!J66","v":{"v":35,"d":"$35.00"}}]
[null,null,{"$f":"'AFILIACIONES Y PERMISOS 2025'!E67","v":"Koryo"},{"$f":"'AFILIACIONES Y PERMISOS 2025'!F67","v":"Guillermo Puga - Sharon López"},{"$f":"'AFILIACIONES Y PERMISOS 2025'!J67","v":{"v":70,"d":"$70.00"}}]
[null,null,{"$f":"'AFILIACIONES Y PERMISOS 2025'!E68","v":"Koryo Sucursal"},{"$f":"'AFILIACIONES Y PERMISOS 2025'!F68","v":"Guillermo Puga - Sharon López"},{"$f":"'AFILIACIONES Y PERMISOS 2025'!J68","v":{"v":50,"d":"$50.00"}}]
[null,null,{"$f":"'AFILIACIONES Y PERMISOS 2025'!E70","v":"Kumgan Dul"},{"$f":"'AFILIACIONES Y PERMISOS 2025'!F70","v":"Fabián García"},{"$f":"'AFILIACIONES Y PERMISOS 2025'!J70","v":{"v":70,"d":"$70.00"}}]
[null,null,{"$f":"'AFILIACIONES Y PERMISOS 2025'!E74","v":"Liga Deportiva Cantonal Mejía"},{"$f":"'AFILIACIONES Y PERMISOS 2025'!F74","v":"Vladimir Viana"},{"$f":"'AFILIACIONES Y PERMISOS 2025'!J74","v":{"v":70,"d":"$70.00"}}]
[null,null,{"$f":"'AFILIACIONES Y PERMISOS 2025'!E76","v":"Lobos"},{"$f":"'AFILIACIONES Y PERMISOS 2025'!F76","v":"Cristian Flores"},{"$f":"'AFILIACIONES Y PERMISOS 2025'!J76","v":{"v":70,"d":"$70.00"}}]
[null,null,{"$f":"'AFILIACIONES Y PERMISOS 2025'!E78","v":"Master Home"},{"$f":"'AFILIACIONES Y PERMISOS 2025'!F78","v":"Marlon Lema"},{"$f":"'AFILIACIONES Y PERMISOS 2025'!J78","v":{"v":70,"d":"$70.00"}}]
[null,null,{"$f":"'AFILIACIONES Y PERMISOS 2025'!E80","v":"Mercenarios"},{"$f":"'AFILIACIONES Y PERMISOS 2025'!F80","v":"Luis Cano"},{"$f":"'AFILIACIONES Y PERMISOS 2025'!J80","v":{"v":70,"d":"$70.00"}}]
[null,null,{"$f":"'AFILIACIONES Y PERMISOS 2025'!E82","v":"Millenium"},{"$f":"'AFILIACIONES Y PERMISOS 2025'!F82","v":"Jean Galora"},{"$f":"'AFILIACIONES Y PERMISOS 2025'!J82","v":{"v":70,"d":"$70.00"}}]
[null,null,{"$f":"'AFILIACIONES Y PERMISOS 2025'!E87","v":"Pandademon"},{"$f":"'AFILIACIONES Y PERMISOS 2025'!F87","v":"Andrés Herrera"},{"$f":"'AFILIACIONES Y PERMISOS 2025'!J87","v":{"v":70,"d":"$70.00"}}]
[null,null,{"$f":"'AFILIACIONES Y PERMISOS 2025'!E95","v":"Rojas Iron First"},{"$f":"'AFILIACIONES Y PERMISOS 2025'!F95","v":"Jorge Rojas"},{"$f":"'AFILIACIONES Y PERMISOS 2025'!J95","v":{"v":70,"d":"$70.00"}}]
[null,null,{"$f":"'AFILIACIONES Y PERMISOS 2025'!E98","v":"San Francisco Tigres"},{"$f":"'AFILIACIONES Y PERMISOS 2025'!F98","v":"Carlos Mejía"},{"$f":"'AFILIACIONES Y PERMISOS 2025'!J98","v":{"v":30,"d":"$30.00"}}]
[null,null,{"$f":"'AFILIACIONES Y PERMISOS 2025'!E100","v":"Sabonim"},{"$f":"'AFILIACIONES Y PERMISOS 2025'!F100","v":"Esteban Altamirano"},{"$f":"'AFILIACIONES Y PERMISOS 2025'!J100","v":{"v":200,"d":"$200.00"}}]
[null,null,{"$f":"'AFILIACIONES Y PERMISOS 2025'!E101","v":"Scorpius"},{"$f":"'AFILIACIONES Y PERMISOS 2025'!F101","v":"Dario Flores"},{"$f":"'AFILIACIONES Y PERMISOS 2025'!J101","v":{"v":70,"d":"$70.00"}}]
[null,null,{"$f":"'AFILIACIONES Y PERMISOS 2025'!E103","v":"Seúl Capelo (Sucursal)"},{"$f":"'AFILIACIONES Y PERMISOS 2025'!F103","v":"Fredy Castillo"},{"$f":"'AFILIACIONES Y PERMISOS 2025'!J103","v":{"v":50,"d":"$50.00"}}]
[null,null,{"$f":"'AFILIACIONES Y PERMISOS 2025'!E104","v":"Seúl Carapungo (Sucursal)"},{"$f":"'AFILIACIONES Y PERMISOS 2025'!F104","v":"José Donoso"},{"$f":"'AFILIACIONES Y PERMISOS 2025'!J104","v":{"v":50,"d":"$50.00"}}]
[null,null,{"$f":"'AFILIACIONES Y PERMISOS 2025'!E105","v":"Seúl Yeong-Gu Carcelen"},{"$f":"'AFILIACIONES Y PERMISOS 2025'!F105","v":"Brusby Muñoz"},{"$f":"'AFILIACIONES Y PERMISOS 2025'!J105","v":{"v":50,"d":"$50.00"}}]
[null,null,{"$f":"'AFILIACIONES Y PERMISOS 2025'!E106","v":"Seúl Gedeon (Sucursal)"},{"$f":"'AFILIACIONES Y PERMISOS 2025'!F106","v":"José Luís Palacios"},{"$f":"'AFILIACIONES Y PERMISOS 2025'!J106","v":{"v":50,"d":"$50.00"}}]
[null,null,{"$f":"'AFILIACIONES Y PERMISOS 2025'!E112","v":"Tae  Baek  Junior"},{"$f":"'AFILIACIONES Y PERMISOS 2025'!F112","v":"Edwin  Arteaga Jr."},{"$f":"'AFILIACIONES Y PERMISOS 2025'!J112","v":{"v":70,"d":"$70.00"}}]
[null,null,{"$f":"'AFILIACIONES Y PERMISOS 2025'!E113","v":"Tae Baek Junior Sucursal Solanda"},{"$f":"'AFILIACIONES Y PERMISOS 2025'!F113","v":"Edwin  Arteaga Jr."},{"$f":"'AFILIACIONES Y PERMISOS 2025'!J113","v":{"v":50,"d":"$50.00"}}]
[null,null,{"$f":"'AFILIACIONES Y PERMISOS 2025'!E115","v":"Tae Kings"},{"$f":"'AFILIACIONES Y PERMISOS 2025'!F115","v":"Jorge Astudillo S."},{"$f":"'AFILIACIONES Y PERMISOS 2025'!J115","v":{"v":70,"d":"$70.00"}}]
[null,null,{"$f":"'AFILIACIONES Y PERMISOS 2025'!E117","v":"Tae Sho Ku Team Valle (Sucursal)"},{"$f":"'AFILIACIONES Y PERMISOS 2025'!F117","v":"Gissela Estrella"},{"$f":"'AFILIACIONES Y PERMISOS 2025'!J117","v":{"v":50,"d":"$50.00"}}]
[null,null,{"$f":"'AFILIACIONES Y PERMISOS 2025'!E125","v":"Team Tauro Taekwondo"},{"$f":"'AFILIACIONES Y PERMISOS 2025'!F125","v":"José Chiriboga"},{"$f":"'AFILIACIONES Y PERMISOS 2025'!J125","v":{"v":220,"d":"$220.00"}}]
[null,null,{"$f":"'AFILIACIONES Y PERMISOS 2025'!E126","v":"Team Vencedores"},{"$f":"'AFILIACIONES Y PERMISOS 2025'!F126","v":"Victor Hugo Quishpe"},{"$f":"'AFILIACIONES Y PERMISOS 2025'!J126","v":{"v":70,"d":"$70.00"}}]
[null,null,{"$f":"'AFILIACIONES Y PERMISOS 2025'!E132","v":"U. San Francisco  USFQ"},{"$f":"'AFILIACIONES Y PERMISOS 2025'!F132","v":"Carlos Reinoso"},{"$f":"'AFILIACIONES Y PERMISOS 2025'!J132","v":{"v":70,"d":"$70.00"}}]
[null,null,{"$f":"'AFILIACIONES Y PERMISOS 2025'!E136","v":"Venom"},{"$f":"'AFILIACIONES Y PERMISOS 2025'!F136","v":"Eddy Cajigal  K."},{"$f":"'AFILIACIONES Y PERMISOS 2025'!J136","v":{"v":24,"d":"$24.00"}}]
[null,null,{"$f":"'AFILIACIONES Y PERMISOS 2025'!E138","v":"Yong Tiger"},{"$f":"'AFILIACIONES Y PERMISOS 2025'!F138","v":"Wilson Rodríguez"},{"$f":"'AFILIACIONES Y PERMISOS 2025'!J138","v":{"v":70,"d":"$70.00"}}]
[]
[]
[null,"CAMPEONATO ESCOLAR - COLEGIAL",{"$nulls":3},{"$f":"SUM(E64:E64)","v":{"v":15,"d":"$15.00"}}]
[null,null,"CLUB","INSCRIPCIÓN","VALOR"]
[null,null,{"$f":"'CAMPEONATO ESCOLAR - COLEGIAL'!B152","v":"UE POMASQUI"},"1 DEPORTISTA",{"$f":"'CAMPEONATO ESCOLAR - COLEGIAL'!C152","v":{"v":15,"d":"$15.00"}}]
[]
[]
[null,"CAMPEONATO ESCOLAR - COLEGIAL",{"$nulls":3},{"$f":"SUM(E69)","v":{"v":48,"d":"$48.00"}}]
[null,null,"CLUB","INSCRIPCIÓN","VALOR"]
[null,null,{"$f":"'II OPEN INT NOV AVA POOM'!B109","v":"YONG TIGER"},"1 DEPORTISTA",{"$f":"'II OPEN INT NOV AVA POOM'!C109","v":{"v":48,"d":"$48.00"}}]
[]
[]
[null,"ACTUALIZACIÓN DE ARBITRAJE COMBATE",{"$nulls":3},{"$f":"SUM(E74:E76)","v":{"v":45,"d":"$45.00"}}]
[null,null,"CLUB","INSCRIPCIÓN","VALOR"]
[null,null,{"$f":"'ACTUALIZACIÓN DE ARBITRAJE'!B224","v":"ASO. TKDP (CARLOS MAGALLANES)"},"1 ENTRENADOR",{"$f":"'ACTUALIZACIÓN DE ARBITRAJE'!C224","v":{"v":15,"d":"$15.00"}}]
[null,null,{"$f":"'ACTUALIZACIÓN DE ARBITRAJE'!B225","v":"ATLAS CLUB (KEVIN ROSADO)"},"1 ENTRENADOR",{"$f":"'ACTUALIZACIÓN DE ARBITRAJE'!C225","v":{"v":15,"d":"$15.00"}}]
[null,null,{"$f":"'ACTUALIZACIÓN DE ARBITRAJE'!B226","v":"JOSEON LEGACY (ELLIOTH FREIRE)"},"1 ENTRENADOR",{"$f":"'ACTUALIZACIÓN DE ARBITRAJE'!C226","v":{"v":15,"d":"$15.00"}}]
[]
[]
[null,"POR PAGAR",{"$nulls":3},{"$f":"SUM(E81:E85)","v":{"v":863.5,"d":"$ 863.50"}}]
[null,"ACREEDORES","DETALLE",null,"VALOR"]
[null,"SAMUEL ARDILA","ANTENIMIENTO Y MARCO DE MADERA PARA  TATAMI OLÍMPICO ",null,{"v":400,"d":"$ 400.00"}]
[null,"PROF. MARCELO TROYA","SERVICIOS ENTRENADOR PROVINCIAL DE APOYO AGOSTO",null,{"v":250,"d":"$ 250.00"}]
[null,"GEOVANNY ESPINOZA","MANEJO DE MEDIOS Y REDES SOCIALES AGOSTO",null,{"v":150,"d":"$ 150.00"}]
[null,"CLUBES","SALDO A FAVOR DE CLUBES EN TRÁMITES DE CERTIFICADOS DE ASCENSO",null,{"$f":"'CERTIFICADOS DE ASCENSO 2025'!C135","v":{"v":31.5,"d":"$ 31.50"}}]
[null,"CLUBES","SALDO A FAVOR DE CLUBES EN TRÁMITES DE GAL'S",null,{"$f":"'GAL''S 2025 '!C226","v":{"v":32,"d":"$ 32.00"}}]